{"text_format":"1","workbook":"xlsx","n_sheets":4,"sheets":["FEI Bubble","AMCA 207 Tables","AMCA 208 Tables","PSW_Sheet"],"not_rendered":{"charts":7,"images":2,"macros":1,"external_links":2,"defined_names":20,"comments":0,"pivot_tables":0},"unopened":[],"bounds":{"document_bytes":16777216,"sheet_cells":100000,"rows_first":2000,"rows_last":500,"rows_between":2000,"halvings":0,"cell_chars":16384,"cell_head_chars":4096},"cells_cut":0,"cells_raw":0,"read":"whole","date_system":"1900"}

{"sheet":"FEI Bubble","index":0,"n_rows":120,"n_cols":19,"rows_kept":120,"cut":false,"hidden":false,"merged":[[2,1,2,3],[15,10,15,13],[16,10,16,13],[16,14,16,15],[16,17,16,18],[6,1,6,2],[7,1,7,2],[8,1,8,2],[9,1,9,2],[17,0,17,2],[17,3,17,5],[15,1,15,2],[12,1,12,2],[14,1,14,2],[12,3,12,4]]}
[]
["Please fill the green colored cells."]
[null,"Please fill the green colored cells."]
[null,null,"Model","AAA"]
[null,null,"Size","AA27"]
[]
[null,"Impeller Dia (inches)",null,27]
[null,"Outlet Area (ft2)",null,7.92]
[null,"Max Catalog Speed (RPM)",null,1623]
[null,"Test Speed (RPM)",null,1100]
[null,null,"Drive type","V-Belt"]
[]
[null,"Fan Category",null,"Axial Inline"]
[null,null,"FEI Pressure Basis",{"$f":"VLOOKUP($D$13,'AMCA 208 Tables'!A17:F27,6,FALSE)","v":"Total"}]
[null,"Reference Target Efficiency",null,{"$f":"IF(D14=\"Total\", 0.66, 0.6)","v":0.66}]
[null,"Minimum FEI Level",null,1.1000000000000001,null,null,null,null,null,null,{"$f":"\"Reference Target Efficiency \"&D15*100&\"%\"","v":"Reference Target Efficiency 66%"}]
[null,null,null,null,null,null,null,null,null,null,{"$f":"\"Allowable Selection Range for FEI = \" & TEXT($D$16, \"0.00\") & \" per AMCA 208\"","v":"Allowable Selection Range for FEI = 1.10 per AMCA 208"},null,null,null,{"$f":" \"Maximum Allowable Speed for FEI= \" & TEXT($D$16, \"0.00\")","v":"Maximum Allowable Speed for FEI= 1.10"},null,null,"Fan Curves at Maximum Speeds"]
["Air Performance  at Test Speed",null,null,"Calculated",null,null,"Plotted Pressure",null,null,null,null,null,null,null,"Rmax=",{"$f":"MAX(K20:K130)","v":1623},null,"Max Structural Speed",{"$f":"D9","v":1623}]
["Airflow (CFM)","Test Static Pressure (in. wg)","Fan BHP","Total Pressure (in. wg)","SE","TE",{"$f":"IF($D$14=\"Total\", \"Total Pressure (in.wg)\",\"Static Pressure (in.wg)\")","v":"Total Pressure (in.wg)"},"Airflow (CFM)",{"$f":"IF($D$14=\"Total\", \"Total Pressure (in.wg)\",\"Static Pressure (in.wg)\")","v":"Total Pressure (in.wg)"},"Fan BHP at Test Speed","RPM","Qmax",{"$f":"IF($D$14=\"Total\",\"Ptmax\",IF($D$14=\"Static\",\"Psmax\",\"Not regulated\"))","v":"Ptmax"},"BHPmax","CFM",{"$f":"IF($D$14=\"Total\",\"Pt\",IF($D$14=\"No\",\"Ps\",\"Pressure\"))","v":"Pt"},"K","CFM",{"$f":"IF($D$14=\"Total\",\"Pt\",IF($D$14=\"No\",\"Ps\",\"Pressure\"))","v":"Pt"}]
[17210,1.9E-2,3.0720000000000001,{"$f":"IF(ISNUMBER(A20),B20+(A20/$D$8/4005)^2,\"\")","v":0.31337866851381624},{"$f":"IF(ISNUMBER(A20),A20*B20/6343/C20,\"\")","v":1.6781027477797049E-2},{"$f":"IF(ISNUMBER(A20),A20*D20/6343/C20,\"\")","v":0.27677979196241065},{"$f":"IF($D$14=\"Total\",D20,B20)","v":0.31337866851381624},{"$f":"A20","v":17210},{"$f":"IF($D$14=\"Total\",D20,B20)","v":0.31337866851381624},{"$f":"C20","v":3.0720000000000001},{"$f":"IF(H20<>0,RPM_AMCA208(H20,I20,J20,$D$10,$D$9,$D$15,$D$11,$D$16),0)","v":975},{"$f":"IF(ISNUMBER(H20),IF(H20=0,0,H20*(K20/$D$10)^1),\"\")","v":15254.318181818182},{"$f":"IF(ISNUMBER(H20),IF(H20=0,0,I20*(K20/$D$10)^2),\"\")","v":0.24620297252557569},{"$f":"IF(ISNUMBER(H20),IF(H20=0,0,J20*(K20/$D$10)^3),\"\")","v":2.1392276483846731},{"$f":"IF(ISNUMBER(A20),A20*($P$18/$D$10)^1,\"\")","v":25392.572727272727},{"$f":"IF(ISNUMBER(A20),G20*($P$18/$D$10)^2,\"\")","v":0.68221474273853722},{"$f":"IF(ISNUMBER(H20),IF(H20=0,0,I20/H20^2),\"\")","v":1.0580536514749315E-9},{"$f":"IF(ISNUMBER(A20),A20*($S$18/$D$10)^1,\"\")","v":25392.572727272727},{"$f":"IF(ISNUMBER(A20),G20*($S$18/$D$10)^2,\"\")","v":0.68221474273853722}]
[15611,0.86499999999999999,4.2359999999999998,1.1072177934209673,0.50256954607973492,0.64329935705315733,{"$f":"IF($D$14=\"Total\",D21,B21)","v":1.1072177934209673},{"$f":"H20+(H30-H20)*0.1","v":17050.099999999999},{"$f":"I20+(I30-I20)*0.1","v":0.39276258100453132},{"$f":"J20+(J30-J20)*0.1","v":3.1884000000000001},{"$f":"IF(H21<>0,RPM_AMCA208(H21,I21,J21,$D$10,$D$9,$D$15,$D$11,$D$16),0)","v":1018},{"$f":"IF(ISNUMBER(H21),IF(H21=0,0,H21*(K21/$D$10)^1),\"\")","v":15779.092545454543},{"$f":"IF(ISNUMBER(H21),IF(H21=0,0,I21*(K21/$D$10)^2),\"\")","v":0.33638784214623135},{"$f":"IF(ISNUMBER(H21),IF(H21=0,0,J21*(K21/$D$10)^3),\"\")","v":2.527191074041172},23033.320909090908,2.4103756189803129,{"$f":"IF(ISNUMBER(H21),IF(H21=0,0,I21/H21^2),\"\")","v":1.3510650023971676E-9},23033.320909090908,2.4103756189803129]
[13763,1.591,5.1319999999999997,1.7792655319440915,0.67266980041579894,0.75226787571310028,1.7792655319440915,{"$f":"H20+(H30-H20)*0.2","v":16890.2},{"$f":"I20+(I30-I20)*0.2","v":0.47214649349524646},{"$f":"J20+(J30-J20)*0.2","v":3.3048000000000002},{"$f":"IF(H22<>0,RPM_AMCA208(H22,I22,J22,$D$10,$D$9,$D$15,$D$11,$D$16),0)","v":1067},16383.494000000001,0.44424263572967737,3.0162017304000002,20306.680909090908,3.8734007738796339,1.6550350069724236E-9,20306.680909090908,3.8734007738796339]
[12350,2.048,5.5679999999999996,2.1995927778310804,0.71614831083591113,0.76915754510283096,2.1995927778310804,{"$f":"H20+(H30-H20)*0.3","v":16730.3},{"$f":"I20+(I30-I20)*0.3","v":0.55153040598596159},{"$f":"J20+(J30-J20)*0.3","v":3.4211999999999998},{"$f":"IF(H23<>0,RPM_AMCA208(H23,I23,J23,$D$10,$D$9,$D$15,$D$11,$D$16),0)","v":1121},17049.696636363635,0.57278985199058241,3.6209059594990225,18221.863636363636,4.7884389456821523,1.970434500436085E-9,18221.863636363636,4.7884389456821523]
[11033,2.3969999999999998,5.8949999999999996,2.5179850845534339,0.70726657063004283,0.74296482088014415,2.5179850845534339,{"$f":"H20+(H30-H20)*0.4","v":16570.400000000001},{"$f":"I20+(I30-I20)*0.4","v":0.63091431847667667},{"$f":"J20+(J30-J20)*0.4","v":3.5375999999999999},{"$f":"IF(H24<>0,RPM_AMCA208(H24,I24,J24,$D$10,$D$9,$D$15,$D$11,$D$16),0)","v":1182},17805.648000000001,0.72848391428711434,4.3891770468495857,16278.689999999999,5.481568208917067,2.2977585955855688E-9,16278.689999999999,5.481568208917067]
[9331,2.7080000000000002,5.875,2.7945368285398358,0.67806958919364957,0.69973797611319444,2.7945368285398358,{"$f":"H20+(H30-H20)*0.5","v":16410.5},{"$f":"I20+(I30-I20)*0.5","v":0.71029823096739175},{"$f":"J20+(J30-J20)*0.5","v":3.6539999999999999},{"$f":"IF(H25<>0,RPM_AMCA208(H25,I25,J25,$D$10,$D$9,$D$15,$D$11,$D$16),0)","v":1252},18678.132727272729,0.92016142002835577,5.3877008559218638,13767.466363636362,6.0836119848138903,2.6375281658224356E-9,13767.466363636362,6.0836119848138903]
[7673,2.7829999999999999,5.617,2.8415160486598214,0.59934828817868413,0.61195033402677779,2.8415160486598214,{"$f":"H20+(H30-H20)*0.6","v":16250.6},{"$f":"I20+(I30-I20)*0.6","v":0.78968214345810683},{"$f":"J20+(J30-J20)*0.6","v":3.7704},{"$f":"IF(H26<>0,RPM_AMCA208(H26,I26,J26,$D$10,$D$9,$D$15,$D$11,$D$16),0)","v":1335},19722.319090909092,1.1631332711773754,6.7398955836964687,11321.162727272727,6.1858841551572272,2.9902914336516761E-9,11321.162727272727,6.1858841551572272]
[5951,2.5680000000000001,4.8630000000000004,2.6031985275799556,0.49543420673967897,0.50222492114387685,2.6031985275799556,{"$f":"H20+(H30-H20)*0.7","v":16090.7},{"$f":"I20+(I30-I20)*0.7","v":0.86906605594882191},{"$f":"J20+(J30-J20)*0.7","v":3.8868},{"$f":"IF(H27<>0,RPM_AMCA208(H27,I27,J27,$D$10,$D$9,$D$15,$D$11,$D$16),0)","v":1433},20961.793727272729,1.474890567077926,8.593156271804359,8780.43,5.6670749869881485,3.3566256732316397E-9,8780.43,5.6670749869881485]
[4669,2.4529999999999998,4.2679999999999998,2.4746666787358458,0.42306032626273626,0.42679710252650177,2.4746666787358458,{"$f":"H20+(H30-H20)*0.8","v":15930.8},{"$f":"I20+(I30-I20)*0.8","v":0.94844996843953711},{"$f":"J20+(J30-J20)*0.8","v":4.0031999999999996},{"$f":"IF(H28<>0,RPM_AMCA208(H28,I28,J28,$D$10,$D$9,$D$15,$D$11,$D$16),0)","v":1554},22505.875636363638,1.8929148793257302,11.287097483309392,6888.8972727272721,5.3872655072659281,3.7371390363600699E-9,6888.8972727272721,5.3872655072659281]
[2994,3.09,4.8890000000000002,3.0989093944684738,0.2983290373744712,0.29918920924352277,3.0989093944684738,{"$f":"H20+(H30-H20)*0.9","v":15770.9},{"$f":"I20+(I30-I20)*0.9","v":1.0278338809302521},{"$f":"J20+(J30-J20)*0.9","v":4.1196000000000002},{"$f":"IF(H29<>0,RPM_AMCA208(H29,I29,J29,$D$10,$D$9,$D$15,$D$11,$D$16),0)","v":1623},23269.246090909088,2.2375595313561352,13.232215143120358,4417.5109090909091,6.7462207473899545,4.132472512155431E-9,4417.5109090909091,6.7462207473899545]
[2005,3.4969999999999999,5.3639999999999999,{"$f":"IF(ISNUMBER(A30),B30+(A30/$D$8/4005)^2,\"\")","v":3.5009955203769958},{"$f":"IF(ISNUMBER(A30),A30*B30/6343/C30,\"\")","v":0.20607557897912324},{"$f":"IF(ISNUMBER(A30),A30*D30/6343/C30,\"\")","v":0.2063110319888494},3.5009955203769958,{"$f":"A21","v":15611},{"$f":"IF($D$14=\"Total\",D21,B21)","v":1.1072177934209673},{"$f":"C21","v":4.2359999999999998},{"$f":"IF(H30<>0,RPM_AMCA208(H30,I30,J30,$D$10,$D$9,$D$15,$D$11,$D$16),0)","v":1623},23033.320909090908,2.4103756189803129,13.606093636823436,2958.2863636363636,7.6215486190868873,4.5433020316574486E-9,2958.2863636363636,7.6215486190868873]
[null,null,null,"","","",null,{"$f":"H30+(H40-H30)*0.1","v":15426.2},{"$f":"I30+(I40-I30)*0.1","v":1.1744225672732798},{"$f":"J30+(J40-J30)*0.1","v":4.3255999999999997},{"$f":"IF(H31<>0,RPM_AMCA208(H31,I31,J31,$D$10,$D$9,$D$15,$D$11,$D$16),0)","v":1623},22760.656909090907,2.5566781344702449,13.893890140567388,"","",null,"",""]
[null,null,null,null,null,null,null,{"$f":"H30+(H40-H30)*0.2","v":15241.4},{"$f":"I30+(I40-I30)*0.2","v":1.241627341125592},{"$f":"J30+(J40-J30)*0.2","v":4.4151999999999996},{"$f":"IF(H32<>0,RPM_AMCA208(H32,I32,J32,$D$10,$D$9,$D$15,$D$11,$D$16),0)","v":1623},22487.992909090906,2.702980649960177,14.181686644311339,"","",null,"",""]
[null,null,null,null,null,null,null,{"$f":"H30+(H40-H30)*0.3","v":15056.6},{"$f":"I30+(I40-I30)*0.3","v":1.3088321149779045},{"$f":"J30+(J40-J30)*0.3","v":4.5047999999999995},{"$f":"IF(H33<>0,RPM_AMCA208(H33,I33,J33,$D$10,$D$9,$D$15,$D$11,$D$16),0)","v":1623},22215.328909090909,2.849283165450109,14.469483148055291,"","",null,"",""]
[null,null,null,null,null,null,null,{"$f":"H30+(H40-H30)*0.4","v":14871.8},{"$f":"I30+(I40-I30)*0.4","v":1.376036888830217},{"$f":"J30+(J40-J30)*0.4","v":4.5943999999999994},{"$f":"IF(H34<>0,RPM_AMCA208(H34,I34,J34,$D$10,$D$9,$D$15,$D$11,$D$16),0)","v":1623},21942.664909090905,2.9955856809400414,14.757279651799243,"","",null,"",""]
[null,null,null,null,null,null,null,{"$f":"H30+(H40-H30)*0.5","v":14687},{"$f":"I30+(I40-I30)*0.5","v":1.4432416626825293},{"$f":"J30+(J40-J30)*0.5","v":4.6839999999999993},{"$f":"IF(H35<>0,RPM_AMCA208(H35,I35,J35,$D$10,$D$9,$D$15,$D$11,$D$16),0)","v":1623},21670.000909090908,3.141888196429973,15.045076155543194,"","",null,"",""]
[null,null,null,null,null,null,null,{"$f":"H30+(H40-H30)*0.6","v":14502.2},{"$f":"I30+(I40-I30)*0.6","v":1.5104464365348418},{"$f":"J30+(J40-J30)*0.6","v":4.7736000000000001},{"$f":"IF(H36<>0,RPM_AMCA208(H36,I36,J36,$D$10,$D$9,$D$15,$D$11,$D$16),0)","v":1623},21397.336909090907,3.2881907119199054,15.332872659287149,"","",null,"",""]
[null,null,null,null,null,null,null,{"$f":"H30+(H40-H30)*0.7","v":14317.4},{"$f":"I30+(I40-I30)*0.7","v":1.5776512103871543},{"$f":"J30+(J40-J30)*0.7","v":4.8632},{"$f":"IF(H37<>0,RPM_AMCA208(H37,I37,J37,$D$10,$D$9,$D$15,$D$11,$D$16),0)","v":1623},21124.672909090907,3.4344932274098374,15.620669163031101,"","",null,"",""]
[null,null,null,null,null,null,null,{"$f":"H30+(H40-H30)*0.8","v":14132.6},{"$f":"I30+(I40-I30)*0.8","v":1.6448559842394666},{"$f":"J30+(J40-J30)*0.8","v":4.9527999999999999},{"$f":"IF(H38<>0,RPM_AMCA208(H38,I38,J38,$D$10,$D$9,$D$15,$D$11,$D$16),0)","v":1623},20852.00890909091,3.5807957428997694,15.908465666775053,"","",null,"",""]
[null,null,null,null,null,null,null,{"$f":"H30+(H40-H30)*0.9","v":13947.8},{"$f":"I30+(I40-I30)*0.9","v":1.7120607580917793},{"$f":"J30+(J40-J30)*0.9","v":5.0423999999999998},{"$f":"IF(H39<>0,RPM_AMCA208(H39,I39,J39,$D$10,$D$9,$D$15,$D$11,$D$16),0)","v":1623},20579.344909090905,3.7270982583897019,16.196262170519002,"","",null,"",""]
[null,null,null,null,null,null,null,{"$f":"A22","v":13763},{"$f":"IF($D$14=\"Total\",D22,B22)","v":1.7792655319440915},{"$f":"C22","v":5.1319999999999997},{"$f":"IF(H40<>0,RPM_AMCA208(H40,I40,J40,$D$10,$D$9,$D$15,$D$11,$D$16),0)","v":1623},20306.680909090908,3.8734007738796339,16.484058674262954,"","",null,"",""]
[null,null,null,null,null,null,null,{"$f":"H40+(H50-H40)*0.1","v":13621.7},{"$f":"I40+(I50-I40)*0.1","v":1.8212982565327904},{"$f":"J40+(J50-J40)*0.1","v":5.1755999999999993},{"$f":"IF(H41<>0,RPM_AMCA208(H41,I41,J41,$D$10,$D$9,$D$15,$D$11,$D$16),0)","v":1623},20098.199181818181,3.9649045910598857,16.624102508674074,"","",null,"",""]
[null,null,null,null,null,null,null,{"$f":"H40+(H50-H40)*0.2","v":13480.4},{"$f":"I40+(I50-I40)*0.2","v":1.8633309811214893},{"$f":"J40+(J50-J40)*0.2","v":5.2191999999999998},{"$f":"IF(H42<>0,RPM_AMCA208(H42,I42,J42,$D$10,$D$9,$D$15,$D$11,$D$16),0)","v":1623},19889.717454545451,4.0564084082401379,16.764146343085194,"","",null,"",""]
[null,null,null,null,null,null,null,{"$f":"H40+(H50-H40)*0.3","v":13339.1},{"$f":"I40+(I50-I40)*0.3","v":1.9053637057101882},{"$f":"J40+(J50-J40)*0.3","v":5.2627999999999995},{"$f":"IF(H43<>0,RPM_AMCA208(H43,I43,J43,$D$10,$D$9,$D$15,$D$11,$D$16),0)","v":1623},19681.235727272728,4.1479122254203897,16.904190177496314,"","",null,"",""]
[null,null,null,null,null,null,null,{"$f":"H40+(H50-H40)*0.4","v":13197.8},{"$f":"I40+(I50-I40)*0.4","v":1.9473964302988871},{"$f":"J40+(J50-J40)*0.4","v":5.3064},{"$f":"IF(H44<>0,RPM_AMCA208(H44,I44,J44,$D$10,$D$9,$D$15,$D$11,$D$16),0)","v":1623},19472.753999999997,4.2394160426006415,17.044234011907434,"","",null,"",""]
[null,null,null,null,null,null,null,{"$f":"H40+(H50-H40)*0.5","v":13056.5},{"$f":"I40+(I50-I40)*0.5","v":1.989429154887586},{"$f":"J40+(J50-J40)*0.5","v":5.35},{"$f":"IF(H45<>0,RPM_AMCA208(H45,I45,J45,$D$10,$D$9,$D$15,$D$11,$D$16),0)","v":1623},19264.27227272727,4.3309198597808933,17.184277846318551,"","",null,"",""]
[null,null,null,null,null,null,null,{"$f":"H40+(H50-H40)*0.6","v":12915.2},{"$f":"I40+(I50-I40)*0.6","v":2.0314618794762849},{"$f":"J40+(J50-J40)*0.6","v":5.3935999999999993},{"$f":"IF(H46<>0,RPM_AMCA208(H46,I46,J46,$D$10,$D$9,$D$15,$D$11,$D$16),0)","v":1623},19055.790545454543,4.4224236769611451,17.324321680729671,"","",null,"",""]
[null,null,null,null,null,null,null,{"$f":"H40+(H50-H40)*0.7","v":12773.9},{"$f":"I40+(I50-I40)*0.7","v":2.073494604064984},{"$f":"J40+(J50-J40)*0.7","v":5.4371999999999998},{"$f":"IF(H47<>0,RPM_AMCA208(H47,I47,J47,$D$10,$D$9,$D$15,$D$11,$D$16),0)","v":1623},18847.308818181817,4.5139274941413978,17.464365515140791,"","",null,"",""]
[null,null,null,null,null,null,null,{"$f":"H40+(H50-H40)*0.8","v":12632.6},{"$f":"I40+(I50-I40)*0.8","v":2.1155273286536826},{"$f":"J40+(J50-J40)*0.8","v":5.4807999999999995},{"$f":"IF(H48<>0,RPM_AMCA208(H48,I48,J48,$D$10,$D$9,$D$15,$D$11,$D$16),0)","v":1623},18638.82709090909,4.6054313113216487,17.604409349551911,"","",null,"",""]
[null,null,null,null,null,null,null,{"$f":"H40+(H50-H40)*0.9","v":12491.3},{"$f":"I40+(I50-I40)*0.9","v":2.1575600532423813},{"$f":"J40+(J50-J40)*0.9","v":5.5244},{"$f":"IF(H49<>0,RPM_AMCA208(H49,I49,J49,$D$10,$D$9,$D$15,$D$11,$D$16),0)","v":1623},18430.345363636363,4.6969351285019005,17.744453183963032,"","",null,"",""]
[null,null,null,null,null,null,null,{"$f":"A23","v":12350},{"$f":"IF($D$14=\"Total\",D23,B23)","v":2.1995927778310804},{"$f":"C23","v":5.5679999999999996},{"$f":"IF(H50<>0,RPM_AMCA208(H50,I50,J50,$D$10,$D$9,$D$15,$D$11,$D$16),0)","v":1623},18221.863636363636,4.7884389456821523,17.884497018374148,"","",null,"",""]
[null,null,null,null,null,null,null,{"$f":"H50+(H60-H50)*0.1","v":12218.3},{"$f":"I50+(I60-I50)*0.1","v":2.2314320085033157},{"$f":"J50+(J60-J50)*0.1","v":5.6006999999999998},{"$f":"IF(H51<>0,RPM_AMCA208(H51,I51,J51,$D$10,$D$9,$D$15,$D$11,$D$16),0)","v":1623},18027.546272727272,4.8577518720056441,17.989529894182489,"","",null,"",""]
[null,null,null,null,null,null,null,{"$f":"H50+(H60-H50)*0.2","v":12086.6},{"$f":"I50+(I60-I50)*0.2","v":2.263271239175551},{"$f":"J50+(J60-J50)*0.2","v":5.6334},{"$f":"IF(H52<>0,RPM_AMCA208(H52,I52,J52,$D$10,$D$9,$D$15,$D$11,$D$16),0)","v":1623},17833.228909090907,4.9270647983291349,18.09456276999083,{"$f":"IF(ISNUMBER(A52),A52*($P$18/$D$10)^1,\"\")","v":""},{"$f":"IF(ISNUMBER(A52),G52*($P$18/$D$10)^2,\"\")","v":""},null,{"$f":"IF(ISNUMBER(A52),A52*($S$18/$D$10)^1,\"\")","v":""},{"$f":"IF(ISNUMBER(A52),G52*($S$18/$D$10)^2,\"\")","v":""}]
[null,null,null,null,null,null,null,{"$f":"H50+(H60-H50)*0.3","v":11954.9},{"$f":"I50+(I60-I50)*0.3","v":2.2951104698477867},{"$f":"J50+(J60-J50)*0.3","v":5.6660999999999992},{"$f":"IF(H53<>0,RPM_AMCA208(H53,I53,J53,$D$10,$D$9,$D$15,$D$11,$D$16),0)","v":1623},17638.911545454543,4.9963777246526275,18.199595645799167,"","",null,"",""]
[null,null,null,null,null,null,null,{"$f":"H50+(H60-H50)*0.4","v":11823.2},{"$f":"I50+(I60-I50)*0.4","v":2.3269497005200219},{"$f":"J50+(J60-J50)*0.4","v":5.6987999999999994},{"$f":"IF(H54<>0,RPM_AMCA208(H54,I54,J54,$D$10,$D$9,$D$15,$D$11,$D$16),0)","v":1623},17444.594181818182,5.0656906509761184,18.304628521607508,"","",null,"",""]
[null,null,null,null,null,null,null,{"$f":"H50+(H60-H50)*0.5","v":11691.5},{"$f":"I50+(I60-I50)*0.5","v":2.3587889311922572},{"$f":"J50+(J60-J50)*0.5","v":5.7314999999999996},{"$f":"IF(H55<>0,RPM_AMCA208(H55,I55,J55,$D$10,$D$9,$D$15,$D$11,$D$16),0)","v":1623},17250.276818181817,5.1350035772996101,18.409661397415846,"","",null,"",""]
[null,null,null,null,null,null,null,{"$f":"H50+(H60-H50)*0.6","v":11559.8},{"$f":"I50+(I60-I50)*0.6","v":2.3906281618644925},{"$f":"J50+(J60-J50)*0.6","v":5.7641999999999998},{"$f":"IF(H56<>0,RPM_AMCA208(H56,I56,J56,$D$10,$D$9,$D$15,$D$11,$D$16),0)","v":1623},17055.959454545453,5.2043165036231009,18.514694273224187,"","",null,"",""]
[null,null,null,null,null,null,null,{"$f":"H50+(H60-H50)*0.7","v":11428.1},{"$f":"I50+(I60-I50)*0.7","v":2.4224673925367277},{"$f":"J50+(J60-J50)*0.7","v":5.7968999999999999},{"$f":"IF(H57<>0,RPM_AMCA208(H57,I57,J57,$D$10,$D$9,$D$15,$D$11,$D$16),0)","v":1623},16861.642090909092,5.2736294299465927,18.619727149032528,"","",null,"",""]
[null,null,null,null,null,null,null,{"$f":"H50+(H60-H50)*0.8","v":11296.4},{"$f":"I50+(I60-I50)*0.8","v":2.4543066232089634},{"$f":"J50+(J60-J50)*0.8","v":5.8295999999999992},{"$f":"IF(H58<>0,RPM_AMCA208(H58,I58,J58,$D$10,$D$9,$D$15,$D$11,$D$16),0)","v":1623},16667.324727272724,5.3429423562700844,18.724760024840865,"","",null,"",""]
[null,null,null,null,null,null,null,{"$f":"H50+(H60-H50)*0.9","v":11164.7},{"$f":"I50+(I60-I50)*0.9","v":2.4861458538811987},{"$f":"J50+(J60-J50)*0.9","v":5.8622999999999994},{"$f":"IF(H59<>0,RPM_AMCA208(H59,I59,J59,$D$10,$D$9,$D$15,$D$11,$D$16),0)","v":1623},16473.007363636363,5.4122552825935761,18.829792900649206,"","",null,"",""]
[null,null,null,null,null,null,null,{"$f":"A24","v":11033},{"$f":"IF($D$14=\"Total\",D24,B24)","v":2.5179850845534339},{"$f":"C24","v":5.8949999999999996},{"$f":"IF(H60<>0,RPM_AMCA208(H60,I60,J60,$D$10,$D$9,$D$15,$D$11,$D$16),0)","v":1623},16278.689999999999,5.481568208917067,18.934825776457544,"","",null,"",""]
[null,null,null,null,null,null,null,{"$f":"H60+(H70-H60)*0.1","v":10862.8},{"$f":"I60+(I70-I60)*0.1","v":2.5456402589520741},{"$f":"J60+(J70-J60)*0.1","v":5.8929999999999998},{"$f":"IF(H61<>0,RPM_AMCA208(H61,I61,J61,$D$10,$D$9,$D$15,$D$11,$D$16),0)","v":1623},16027.567636363634,5.5417725865067498,18.928401747356119,"","",null,"",""]
[null,null,null,null,null,null,null,{"$f":"H60+(H70-H60)*0.2","v":10692.6},{"$f":"I60+(I70-I60)*0.2","v":2.5732954333507143},{"$f":"J60+(J70-J60)*0.2","v":5.891},{"$f":"IF(H62<>0,RPM_AMCA208(H62,I62,J62,$D$10,$D$9,$D$15,$D$11,$D$16),0)","v":1623},15776.445272727273,5.6019769640964316,18.921977718254691,"","",null,"",""]
[null,null,null,null,null,null,null,{"$f":"H60+(H70-H60)*0.3","v":10522.4},{"$f":"I60+(I70-I60)*0.3","v":2.6009506077493545},{"$f":"J60+(J70-J60)*0.3","v":5.8889999999999993},{"$f":"IF(H63<>0,RPM_AMCA208(H63,I63,J63,$D$10,$D$9,$D$15,$D$11,$D$16),0)","v":1623},15525.322909090908,5.6621813416861144,18.915553689153263,"","",null,"",""]
[null,null,null,null,null,null,null,{"$f":"H60+(H70-H60)*0.4","v":10352.200000000001},{"$f":"I60+(I70-I60)*0.4","v":2.6286057821479947},{"$f":"J60+(J70-J60)*0.4","v":5.8869999999999996},{"$f":"IF(H64<>0,RPM_AMCA208(H64,I64,J64,$D$10,$D$9,$D$15,$D$11,$D$16),0)","v":1623},15274.200545454545,5.7223857192757963,18.909129660051835,"","",null,"",""]
[null,null,null,null,null,null,null,{"$f":"H60+(H70-H60)*0.5","v":10182},{"$f":"I60+(I70-I60)*0.5","v":2.6562609565466349},{"$f":"J60+(J70-J60)*0.5","v":5.8849999999999998},{"$f":"IF(H65<>0,RPM_AMCA208(H65,I65,J65,$D$10,$D$9,$D$15,$D$11,$D$16),0)","v":1623},15023.07818181818,5.7825900968654791,18.902705630950408,"","",null,"",""]
[null,null,null,null,null,null,null,{"$f":"H60+(H70-H60)*0.6","v":10011.799999999999},{"$f":"I60+(I70-I60)*0.6","v":2.683916130945275},{"$f":"J60+(J70-J60)*0.6","v":5.883},{"$f":"IF(H66<>0,RPM_AMCA208(H66,I66,J66,$D$10,$D$9,$D$15,$D$11,$D$16),0)","v":1623},14771.955818181816,5.842794474455161,18.89628160184898,"","",null,"",""]
[null,null,null,null,null,null,null,{"$f":"H60+(H70-H60)*0.7","v":9841.6},{"$f":"I60+(I70-I60)*0.7","v":2.7115713053439152},{"$f":"J60+(J70-J60)*0.7","v":5.8810000000000002},{"$f":"IF(H67<>0,RPM_AMCA208(H67,I67,J67,$D$10,$D$9,$D$15,$D$11,$D$16),0)","v":1623},14520.833454545455,5.9029988520448438,18.889857572747555,"","",null,"",""]
[null,null,null,null,null,null,null,{"$f":"H60+(H70-H60)*0.8","v":9671.4},{"$f":"I60+(I70-I60)*0.8","v":2.7392264797425554},{"$f":"J60+(J70-J60)*0.8","v":5.8789999999999996},{"$f":"IF(H68<>0,RPM_AMCA208(H68,I68,J68,$D$10,$D$9,$D$15,$D$11,$D$16),0)","v":1623},14269.71109090909,5.9632032296345256,18.883433543646124,"","",null,"",""]
[null,null,null,null,null,null,null,{"$f":"H60+(H70-H60)*0.9","v":9501.2000000000007},{"$f":"I60+(I70-I60)*0.9","v":2.7668816541411956},{"$f":"J60+(J70-J60)*0.9","v":5.8769999999999998},{"$f":"IF(H69<>0,RPM_AMCA208(H69,I69,J69,$D$10,$D$9,$D$15,$D$11,$D$16),0)","v":1623},14018.588727272727,6.0234076072242084,18.877009514544699,"","",null,"",""]
[null,null,null,null,null,null,null,{"$f":"A25","v":9331},{"$f":"IF($D$14=\"Total\",D25,B25)","v":2.7945368285398358},{"$f":"C25","v":5.875},{"$f":"IF(H70<>0,RPM_AMCA208(H70,I70,J70,$D$10,$D$9,$D$15,$D$11,$D$16),0)","v":1623},13767.466363636362,6.0836119848138903,18.870585485443272,"","",null,"",""]
[null,null,null,null,null,null,null,{"$f":"H70+(H80-H70)*0.1","v":9165.2000000000007},{"$f":"I70+(I80-I70)*0.1","v":2.7992347505518342},{"$f":"J70+(J80-J70)*0.1","v":5.8491999999999997},{"$f":"IF(H71<>0,RPM_AMCA208(H71,I71,J71,$D$10,$D$9,$D$15,$D$11,$D$16),0)","v":1623},13522.835999999999,6.0938392018482244,18.787715510034857,"","",null,"",""]
[null,null,null,null,null,null,null,{"$f":"H70+(H80-H70)*0.2","v":8999.4},{"$f":"I70+(I80-I70)*0.2","v":2.8039326725638327},{"$f":"J70+(J80-J70)*0.2","v":5.8234000000000004},{"$f":"IF(H72<>0,RPM_AMCA208(H72,I72,J72,$D$10,$D$9,$D$15,$D$11,$D$16),0)","v":1623},13278.205636363635,6.1040664188825575,18.704845534626443,"","",null,"",""]
[null,null,null,null,null,null,null,{"$f":"H70+(H80-H70)*0.3","v":8833.6},{"$f":"I70+(I80-I70)*0.3","v":2.8086305945758316},{"$f":"J70+(J80-J70)*0.3","v":5.7976000000000001},{"$f":"IF(H73<>0,RPM_AMCA208(H73,I73,J73,$D$10,$D$9,$D$15,$D$11,$D$16),0)","v":1623},13033.575272727272,6.1142936359168916,18.621975559218029,"","",null,"",""]
[null,null,null,null,null,null,null,{"$f":"H70+(H80-H70)*0.4","v":8667.7999999999993},{"$f":"I70+(I80-I70)*0.4","v":2.8133285165878301},{"$f":"J70+(J80-J70)*0.4","v":5.7717999999999998},{"$f":"IF(H74<>0,RPM_AMCA208(H74,I74,J74,$D$10,$D$9,$D$15,$D$11,$D$16),0)","v":1572},12387.074181818181,5.7456631544922159,16.845769093318108,"","",null,"",""]
[null,null,null,null,null,null,null,{"$f":"H70+(H80-H70)*0.5","v":8502},{"$f":"I70+(I80-I70)*0.5","v":2.8180264385998286},{"$f":"J70+(J80-J70)*0.5","v":5.7460000000000004},{"$f":"IF(H75<>0,RPM_AMCA208(H75,I75,J75,$D$10,$D$9,$D$15,$D$11,$D$16),0)","v":1435},11091.245454545453,4.7958268537402731,12.756844725582267,"","",null,"",""]
[null,null,null,null,null,null,null,{"$f":"H70+(H80-H70)*0.6","v":8336.2000000000007},{"$f":"I70+(I80-I70)*0.6","v":2.8227243606118271},{"$f":"J70+(J80-J70)*0.6","v":5.7202000000000002},{"$f":"IF(H76<>0,RPM_AMCA208(H76,I76,J76,$D$10,$D$9,$D$15,$D$11,$D$16),0)","v":1330},10079.223636363637,4.1265430756084793,10.110859629902327,"","",null,"",""]
[null,null,null,null,null,null,null,{"$f":"H70+(H80-H70)*0.7","v":8170.4},{"$f":"I70+(I80-I70)*0.7","v":2.8274222826238256},{"$f":"J70+(J80-J70)*0.7","v":5.6943999999999999},{"$f":"IF(H77<>0,RPM_AMCA208(H77,I77,J77,$D$10,$D$9,$D$15,$D$11,$D$16),0)","v":1243},9232.5519999999979,3.610335512682362,8.2164326767999967,"","",null,"",""]
[null,null,null,null,null,null,null,{"$f":"H70+(H80-H70)*0.8","v":8004.6},{"$f":"I70+(I80-I70)*0.8","v":2.8321202046358245},{"$f":"J70+(J80-J70)*0.8","v":5.6685999999999996},{"$f":"IF(H78<>0,RPM_AMCA208(H78,I78,J78,$D$10,$D$9,$D$15,$D$11,$D$16),0)","v":1169},8506.7067272727272,3.1985661313779645,6.803639446504433,"","",null,"",""]
[null,null,null,null,null,null,null,{"$f":"H70+(H80-H70)*0.9","v":7838.8},{"$f":"I70+(I80-I70)*0.9","v":2.836818126647823},{"$f":"J70+(J80-J70)*0.9","v":5.6428000000000003},{"$f":"IF(H79<>0,RPM_AMCA208(H79,I79,J79,$D$10,$D$9,$D$15,$D$11,$D$16),0)","v":1104},7867.3047272727281,2.857487042849912,5.7045819361226151,"","",null,"",""]
[null,null,null,null,null,null,null,{"$f":"A26","v":7673},{"$f":"IF($D$14=\"Total\",D26,B26)","v":2.8415160486598214},{"$f":"C26","v":5.617},{"$f":"IF(H80<>0,RPM_AMCA208(H80,I80,J80,$D$10,$D$9,$D$15,$D$11,$D$16),0)","v":1047},7303.300909090909,2.5742937737068874,4.8435792883478577,"","",null,"",""]
[null,null,null,null,null,null,null,{"$f":"H80+(H90-H80)*0.1","v":7500.8},{"$f":"I80+(I90-I80)*0.1","v":2.8176842965518349},{"$f":"J80+(J90-J80)*0.1","v":5.5415999999999999},{"$f":"IF(H81<>0,RPM_AMCA208(H81,I81,J81,$D$10,$D$9,$D$15,$D$11,$D$16),0)","v":993},6771.1767272727275,2.296177506554248,4.0766634969430502,"","",null,"",""]
[null,null,null,null,null,null,null,{"$f":"H80+(H90-H80)*0.2","v":7328.6},{"$f":"I80+(I90-I80)*0.2","v":2.7938525444438485},{"$f":"J80+(J90-J80)*0.2","v":5.4661999999999997},{"$f":"IF(H82<>0,RPM_AMCA208(H82,I82,J82,$D$10,$D$9,$D$15,$D$11,$D$16),0)","v":945},6295.9336363636367,2.0619670814065851,3.4657951359691963,"","",null,"",""]
[null,null,null,null,null,null,null,{"$f":"H80+(H90-H80)*0.3","v":7156.4},{"$f":"I80+(I90-I80)*0.3","v":2.7700207923358615},{"$f":"J80+(J90-J80)*0.3","v":5.3908000000000005},{"$f":"IF(H83<>0,RPM_AMCA208(H83,I83,J83,$D$10,$D$9,$D$15,$D$11,$D$16),0)","v":902},5868.2479999999996,1.8625619807666329,2.9723146143999997,"","",null,"",""]
[null,null,null,null,null,null,null,{"$f":"H80+(H90-H80)*0.4","v":6984.2},{"$f":"I80+(I90-I80)*0.4","v":2.746189040227875},{"$f":"J80+(J90-J80)*0.4","v":5.3154000000000003},{"$f":"IF(H84<>0,RPM_AMCA208(H84,I84,J84,$D$10,$D$9,$D$15,$D$11,$D$16),0)","v":863},5479.4223636363631,1.6903111283483259,2.56678967547994,{"$f":"IF(ISNUMBER(A84),A84*($P$18/$D$10)^1,\"\")","v":""},{"$f":"IF(ISNUMBER(A84),G84*($P$18/$D$10)^2,\"\")","v":""},null,{"$f":"IF(ISNUMBER(A84),A84*($S$18/$D$10)^1,\"\")","v":""},{"$f":"IF(ISNUMBER(A84),G84*($S$18/$D$10)^2,\"\")","v":""}]
[null,null,null,null,null,null,null,{"$f":"H80+(H90-H80)*0.5","v":6812},{"$f":"I80+(I90-I80)*0.5","v":2.7223572881198885},{"$f":"J80+(J90-J80)*0.5","v":5.24},{"$f":"IF(H85<>0,RPM_AMCA208(H85,I85,J85,$D$10,$D$9,$D$15,$D$11,$D$16),0)","v":826},{"$f":"IF(ISNUMBER(H85),IF(H85=0,0,H85*(K85/$D$10)^1),\"\")","v":5115.1927272727271},{"$f":"IF(ISNUMBER(H85),IF(H85=0,0,I85*(K85/$D$10)^2),\"\")","v":1.5350405298423841},{"$f":"IF(ISNUMBER(H85),IF(H85=0,0,J85*(K85/$D$10)^3),\"\")","v":2.2186733841021784},"","",null,"",""]
[null,null,null,null,null,null,null,{"$f":"H80+(H90-H80)*0.6","v":6639.8},{"$f":"I80+(I90-I80)*0.6","v":2.698525536011902},{"$f":"J80+(J90-J80)*0.6","v":5.1646000000000001},{"$f":"IF(H86<>0,RPM_AMCA208(H86,I86,J86,$D$10,$D$9,$D$15,$D$11,$D$16),0)","v":793},4786.6921818181818,1.4024504833021065,1.9349876495132985,"","",null,"",""]
[null,null,null,null,null,null,null,{"$f":"H80+(H90-H80)*0.7","v":6467.6},{"$f":"I80+(I90-I80)*0.7","v":2.6746937839039155},{"$f":"J80+(J90-J80)*0.7","v":5.0891999999999999},{"$f":"IF(H87<>0,RPM_AMCA208(H87,I87,J87,$D$10,$D$9,$D$15,$D$11,$D$16),0)","v":761},4474.4032727272725,1.2801416023373713,1.6850990484036059,"","",null,"",""]
[null,null,null,null,null,null,null,{"$f":"H80+(H90-H80)*0.8","v":6295.4},{"$f":"I80+(I90-I80)*0.8","v":2.6508620317959286},{"$f":"J80+(J90-J80)*0.8","v":5.0137999999999998},{"$f":"IF(H88<>0,RPM_AMCA208(H88,I88,J88,$D$10,$D$9,$D$15,$D$11,$D$16),0)","v":731},4183.5794545454546,1.1706754431177722,1.4714349976677685,"","",null,"",""]
[null,null,null,null,null,null,null,{"$f":"H80+(H90-H80)*0.9","v":6123.2},{"$f":"I80+(I90-I80)*0.9","v":2.6270302796879421},{"$f":"J80+(J90-J80)*0.9","v":4.9384000000000006},{"$f":"IF(H89<>0,RPM_AMCA208(H89,I89,J89,$D$10,$D$9,$D$15,$D$11,$D$16),0)","v":702},3907.7149090909088,1.0699264710341625,1.283569960982119,"","",null,"",""]
[null,null,null,null,null,null,null,{"$f":"A27","v":5951},{"$f":"IF($D$14=\"Total\",D27,B27)","v":2.6031985275799556},{"$f":"C27","v":4.8630000000000004},{"$f":"IF(H90<>0,RPM_AMCA208(H90,I90,J90,$D$10,$D$9,$D$15,$D$11,$D$16),0)","v":673},3640.93,0.97443314537046433,1.1137081730060105,"","",null,"",""]
[null,null,null,null,null,null,null,{"$f":"H90+(H100-H90)*0.1","v":5822.8},{"$f":"I90+(I100-I90)*0.1","v":2.5903453426955445},{"$f":"J90+(J100-J90)*0.1","v":4.8035000000000005},{"$f":"IF(H91<>0,RPM_AMCA208(H91,I91,J91,$D$10,$D$9,$D$15,$D$11,$D$16),0)","v":655},3467.2127272727275,0.91844868648756706,1.0141533732625847,"","",null,"",""]
[null,null,null,null,null,null,null,{"$f":"H90+(H100-H90)*0.2","v":5694.6},{"$f":"I90+(I100-I90)*0.2","v":2.5774921578111338},{"$f":"J90+(J100-J90)*0.2","v":4.7440000000000007},{"$f":"IF(H92<>0,RPM_AMCA208(H92,I92,J92,$D$10,$D$9,$D$15,$D$11,$D$16),0)","v":635},3287.3372727272731,0.85893328539949954,0.91261541622839992,"","",null,"",""]
[null,null,null,null,null,null,null,{"$f":"H90+(H100-H90)*0.3","v":5566.4},{"$f":"I90+(I100-I90)*0.3","v":2.5646389729267227},{"$f":"J90+(J100-J90)*0.3","v":4.6844999999999999},{"$f":"IF(H93<>0,RPM_AMCA208(H93,I93,J93,$D$10,$D$9,$D$15,$D$11,$D$16),0)","v":615},3112.1236363636363,0.80166163267372692,0.81867312748873022,"","",null,"",""]
[null,null,null,null,null,null,null,{"$f":"H90+(H100-H90)*0.4","v":5438.2},{"$f":"I90+(I100-I90)*0.4","v":2.5517857880423116},{"$f":"J90+(J100-J90)*0.4","v":4.625},{"$f":"IF(H94<>0,RPM_AMCA208(H94,I94,J94,$D$10,$D$9,$D$15,$D$11,$D$16),0)","v":590},2916.8527272727274,0.73411291968390802,0.71365730653643877,"","",null,"",""]
[null,null,null,null,null,null,null,{"$f":"H90+(H100-H90)*0.5","v":5310},{"$f":"I90+(I100-I90)*0.5","v":2.5389326031579005},{"$f":"J90+(J100-J90)*0.5","v":4.5655000000000001},{"$f":"IF(H95<>0,RPM_AMCA208(H95,I95,J95,$D$10,$D$9,$D$15,$D$11,$D$16),0)","v":204},984.76363636363635,8.7322495217371218E-2,2.9120631849737039E-2,"","",null,"",""]
[null,null,null,null,null,null,null,{"$f":"H90+(H100-H90)*0.6","v":5181.8},{"$f":"I90+(I100-I90)*0.6","v":2.5260794182734898},{"$f":"J90+(J100-J90)*0.6","v":4.5060000000000002},{"$f":"IF(H96<>0,RPM_AMCA208(H96,I96,J96,$D$10,$D$9,$D$15,$D$11,$D$16),0)","v":208},979.83127272727279,9.0320909051391937E-2,3.0465137093914348E-2,"","",null,"",""]
[null,null,null,null,null,null,null,{"$f":"H90+(H100-H90)*0.7","v":5053.6000000000004},{"$f":"I90+(I100-I90)*0.7","v":2.5132262333890787},{"$f":"J90+(J100-J90)*0.7","v":4.4465000000000003},{"$f":"IF(H97<>0,RPM_AMCA208(H97,I97,J97,$D$10,$D$9,$D$15,$D$11,$D$16),0)","v":212},973.96654545454544,9.3350776721850201E-2,3.183081979864763E-2,"","",null,"",""]
[null,null,null,null,null,null,null,{"$f":"H90+(H100-H90)*0.8","v":4925.3999999999996},{"$f":"I90+(I100-I90)*0.8","v":2.5003730485046676},{"$f":"J90+(J100-J90)*0.8","v":4.3869999999999996},{"$f":"IF(H98<>0,RPM_AMCA208(H98,I98,J98,$D$10,$D$9,$D$15,$D$11,$D$16),0)","v":216},967.16945454545441,9.6411078471928716E-2,3.3216267732531918E-2,"","",null,"",""]
[null,null,null,null,null,null,null,{"$f":"H90+(H100-H90)*0.9","v":4797.2},{"$f":"I90+(I100-I90)*0.9","v":2.4875198636202569},{"$f":"J90+(J100-J90)*0.9","v":4.3274999999999997},{"$f":"IF(H99<>0,RPM_AMCA208(H99,I99,J99,$D$10,$D$9,$D$15,$D$11,$D$16),0)","v":220},959.44,9.9500794544810298E-2,3.4620000000000005E-2,"","",null,"",""]
[null,null,null,null,null,null,null,{"$f":"A28","v":4669},{"$f":"IF($D$14=\"Total\",D28,B28)","v":2.4746666787358458},{"$f":"C28","v":4.2679999999999998},{"$f":"IF(H100<>0,RPM_AMCA208(H100,I100,J100,$D$10,$D$9,$D$15,$D$11,$D$16),0)","v":224},950.77818181818191,0.10261890518367753,3.604046704132232E-2,"","",null,"",""]
[null,null,null,null,null,null,null,null,null,null,null,null,null,null,"","",null,"",""]
[null,null,null,null,null,null,null,null,null,null,null,null,null,null,"","",null,"",""]
[null,null,null,null,null,null,null,null,null,null,null,null,null,null,"","",null,"",""]
[null,null,null,null,null,null,null,null,null,null,null,null,null,null,"","",null,"",""]
[null,null,null,null,null,null,null,null,null,null,null,null,null,null,"","",null,"",""]
[null,null,null,null,null,null,null,null,null,null,null,null,null,null,"","",null,"",""]
[null,null,null,null,null,null,null,null,null,null,null,null,null,null,"","",null,"",""]
[null,null,null,null,null,null,null,null,null,null,null,null,null,null,"","",null,"",""]
[null,null,null,null,null,null,null,null,null,null,null,null,null,null,"","",null,"",""]
[null,null,null,null,null,null,null,null,null,null,null,null,null,null,"","",null,"",""]
[null,null,null,null,null,null,null,null,null,null,null,null,null,null,"","",null,"",""]
[null,null,null,null,null,null,null,null,null,null,null,null,null,null,"","",null,"",""]
[null,null,null,null,null,null,null,null,null,null,null,null,null,null,"","",null,"",""]
[null,null,null,null,null,null,null,null,null,null,null,null,null,null,"","",null,"",""]
[null,null,null,null,null,null,null,null,null,null,null,null,null,null,"","",null,"",""]
[null,null,null,null,null,null,null,null,null,null,null,null,null,null,"","",null,"",""]
[null,null,null,null,null,null,null,null,null,null,null,null,null,null,"","",null,"",""]
[null,null,null,null,null,null,null,null,null,null,null,null,null,null,"","",null,"",""]
[null,null,null,null,null,null,null,null,null,null,null,null,null,null,"","",null,"",""]
[null,null,null,null,null,null,null,null,null,null,null,null,null,null,"","",null,"",""]

{"sheet":"AMCA 207 Tables","index":1,"n_rows":481,"n_cols":13,"rows_kept":481,"cut":false,"hidden":true,"merged":[[447,0,447,3],[448,1,448,3],[362,0,362,4],[363,1,363,4],[387,0,387,4],[388,1,388,4],[417,0,417,4],[418,1,418,4],[339,1,339,4],[273,0,273,12],[274,0,275,0],[274,1,274,3],[274,4,274,5],[274,6,274,8],[274,9,274,11],[306,0,307,2],[308,0,308,2],[309,1,309,2],[337,0,337,4],[338,0,338,4],[245,1,245,3],[245,4,245,6],[245,7,245,9],[245,10,245,12],[150,0,151,0],[150,1,150,3],[150,4,150,6],[150,7,150,9],[150,10,150,12],[183,0,183,3],[211,0,211,3],[244,0,244,12],[245,0,246,0],[121,10,121,12],[149,0,149,12],[90,0,90,9],[91,0,92,0],[91,1,91,3],[91,4,91,6],[91,7,91,9],[120,0,120,12],[121,0,122,0],[121,1,121,3],[121,4,121,6],[121,7,121,9],[59,0,61,0],[59,1,59,3],[59,4,59,6],[59,7,59,9],[0,0,0,4],[1,1,1,4],[29,0,29,4],[30,1,30,4],[58,0,58,9]]}
["Table A1.  EISA 2007 Nominal Motor Effciency"]
["Motor Power (hp)","ODP"]
[null,2,4,6,8]
[1,0.77,0.85499999999999998,0.82499999999999996,0.755]
[1.5,0.84,0.86499999999999999,0.86499999999999999,0.78500000000000003]
[2,0.85499999999999998,0.86499999999999999,0.875,0.84]
[3,0.85499999999999998,0.89500000000000002,0.88500000000000001,0.85499999999999998]
[5,0.86499999999999999,0.89500000000000002,0.89500000000000002,0.86499999999999999]
[7.5,0.88500000000000001,0.91,0.90200000000000002,0.86499999999999999]
[10,0.89500000000000002,0.91700000000000004,0.91700000000000004,0.89500000000000002]
[15,0.90200000000000002,0.93,0.91700000000000004,0.89500000000000002]
[20,0.91,0.93,0.92400000000000004,0.90200000000000002]
[25,0.91700000000000004,0.93600000000000005,0.93,0.90200000000000002]
[30,0.91700000000000004,0.94099999999999995,0.93600000000000005,0.91700000000000004]
[40,0.92400000000000004,0.94099999999999995,0.94099999999999995,0.91700000000000004]
[50,0.93,0.94499999999999995,0.94099999999999995,0.92400000000000004]
[60,0.93600000000000005,0.95,0.94499999999999995,0.92400000000000004]
[75,0.93600000000000005,0.95,0.94499999999999995,0.93600000000000005]
[100,0.93600000000000005,0.95399999999999996,0.95,0.94099999999999995]
[125,0.94099999999999995,0.95399999999999996,0.95,0.94099999999999995]
[150,0.94099999999999995,0.95799999999999996,0.95399999999999996,0.94499999999999995]
[200,0.95,0.95799999999999996,0.95399999999999996,0.94499999999999995]
[250,0.95,0.95799999999999996,0.95799999999999996,0.95]
[300,0.95399999999999996,0.95799999999999996,0.95799999999999996]
[350,0.95399999999999996,0.95799999999999996,0.95499999999999996]
[400,0.95799999999999996,0.95799999999999996]
[450,0.96199999999999997,0.96199999999999997]
[500,0.96199999999999997,0.96199999999999997]
[]
["Table A1.  EISA 2007 Nominal Motor Effciency"]
["Motor Power (hp)","TEFC"]
[null,2,4,6,8]
[1,0.77,0.85499999999999998,0.82499999999999996,0.72]
[1.5,0.84,0.86499999999999999,0.875,0.755]
[2,0.85499999999999998,0.86499999999999999,0.88500000000000001,0.81499999999999995]
[3,0.86499999999999999,0.89500000000000002,0.89500000000000002,0.82499999999999996]
[5,0.88500000000000001,0.89500000000000002,0.89500000000000002,0.84]
[7.5,0.89500000000000002,0.91700000000000004,0.91,0.84]
[10,0.90200000000000002,0.91700000000000004,0.91,0.875]
[15,0.91,0.92400000000000004,0.91700000000000004,0.875]
[20,0.91,0.93,0.91700000000000004,0.88500000000000001]
[25,0.91700000000000004,0.93600000000000005,0.93,0.88500000000000001]
[30,0.91700000000000004,0.93600000000000005,0.93,0.90200000000000002]
[40,0.92400000000000004,0.94099999999999995,0.94099999999999995,0.90200000000000002]
[50,0.93,0.94499999999999995,0.94099999999999995,0.91]
[60,0.93600000000000005,0.95,0.94499999999999995,0.91]
[75,0.93600000000000005,0.95399999999999996,0.94499999999999995,0.92400000000000004]
[100,0.94099999999999995,0.95399999999999996,0.95,0.92400000000000004]
[125,0.95,0.95399999999999996,0.95,0.93]
[150,0.95,0.95799999999999996,0.95799999999999996,0.93]
[200,0.95399999999999996,0.96199999999999997,0.95799999999999996,0.93600000000000005]
[250,0.95799999999999996,0.96199999999999997,0.95799999999999996,0.94099999999999995]
[300,0.95799999999999996,0.96199999999999997]
[350,0.95799999999999996,0.96199999999999997]
[400,0.95799999999999996,0.96199999999999997]
[450,0.95799999999999996,0.96199999999999997]
[500,0.95799999999999996,0.96199999999999997]
[]
["Table A2.  IEC60034-30 Nominal Motor Efficiency"]
["Motor Power (kW)","IE1",null,null,"IE2",null,null,"IE3"]
[null,"2 Pole","4 Pole","6 Pole","2 Pole","4 Pole","6 Pole","2 Pole","4 Pole","6 Pole"]
[null,"50 Hz","50 Hz","50 Hz","50 Hz","50 Hz","50 Hz","50 Hz","50 Hz","50 Hz"]
[1,72.099999999999994,72.099999999999994,70,77.400000000000006,79.599999999999994,75.900000000000006,80.7,82.5,78.900000000000006]
[1.1000000000000001,75,75,72.900000000000006,79.599999999999994,81.400000000000006,78.099999999999994,82.7,84.1,81]
[1.5,77.2,77.2,75.2,81.3,82.8,79.8,84.2,85.3,82.5]
[2.2000000000000002,79.7,79.7,77.7,83.2,84.3,81.8,85.9,86.7,84.3]
[3,81.5,81.5,79.7,84.6,85.5,83.3,87.1,87.7,85.6]
[4,83.1,83.1,81.400000000000006,85.8,86.6,84.6,88.1,88.6,86.8]
[5.5,84.7,84.7,83.1,87,87.7,86,89.2,89.6,88]
[7.5,86,86,84.7,88.1,88.7,87.2,90.1,90.4,89.1]
[11,87.6,87.6,86.4,89.4,89.8,88.7,91.2,91.4,90.3]
[15,88.7,88.7,87.7,90.3,90.6,89.7,91.9,92.1,91.2]
[18.5,89.3,89.3,88.6,90.9,91.2,90.4,92.4,92.6,91.7]
[22,89.9,89.9,89.2,91.3,91.6,90.9,92.7,93,92.2]
[30,90.7,90.7,90.2,92,92.3,91.7,93.3,93.6,92.9]
[37,91.2,91.2,90.8,92.5,92.7,92.2,93.7,93.9,93.3]
[45,91.7,91.7,91.4,92.9,93.1,92.7,94,94.2,93.7]
[55,92.1,92.1,91.9,93.2,93.5,93.1,94.3,94.6,94.1]
[75,92.7,92.7,92.6,93.8,94,93.7,94.7,95,94.6]
[90,93,93,92.9,94.1,94.2,94,95,95.2,94.9]
[110,93.3,93.3,93.3,94.3,94.5,94.3,95.2,95.4,95.1]
[132,93.5,93.5,93.5,94.6,94.7,94.6,95.4,95.6,95.4]
[160,93.8,93.8,93.8,94.8,94.9,94.8,95.6,95.8,95.6]
[200,94,94,94,95,95.1,95,95.8,96,95.8]
[220,94,94,94,95,95.1,95,95.8,96,95.8]
[250,94,94,94,95,95.1,95,95.8,96,95.8]
[300,94,94,94,95,95.1,95,95.8,96,95.8]
[330,94,94,94,95,95.1,95,95.8,96,95.8]
[375,94,94,94,95,95.1,95,95.8,96,95.8]
[]
["Table A3.  GB 18613-2012 Nominal Motor Efficiency"]
["Motor Power (kW)","Grade 1",null,null,"Grade 2",null,null,"Grade 3"]
[null,"2 Pole","4 Pole","6 Pole","2 Pole","4 Pole","6 Pole","2 Pole","4 Pole","6 Pole"]
[1,84.9,85.6,83.1,80.7,82.5,78.900000000000006,77.400000000000006,79.599999999999994,75.900000000000006]
[1.1000000000000001,86.7,87.4,84.1,82.7,84.1,81,79.599999999999994,81.400000000000006,78.099999999999994]
[1.5,87.5,88.1,86.2,84.2,85.3,82.5,81.3,82.8,79.8]
[2.2000000000000002,89.1,89.7,87.1,85.9,86.7,84.3,83.2,84.3,81.8]
[3,89.7,90.3,88.7,87.1,87.7,85.6,84.6,85.5,83.3]
[4,90.3,90.9,89.7,88.1,88.6,86.8,85.8,86.6,84.6]
[5.5,91.5,92.1,89.5,89.2,89.6,88,87,87.7,86]
[7.5,92.1,92.6,90.2,90.1,90.4,89.1,88.1,88.7,87.2]
[11,93,93.6,91.5,91.2,91.4,90.3,89.4,89.8,88.7]
[15,93.4,94,92.5,91.9,92.1,91.2,90.3,90.6,89.7]
[18.5,93.8,94.3,93.1,92.4,92.6,91.7,90.9,91.2,90.4]
[22,94.4,94.7,93.9,92.7,93,92.2,91.3,91.6,90.9]
[30,94.5,95,94.3,93.3,93.6,92.9,92,92.3,91.7]
[37,94.8,95.3,94.6,93.7,93.9,93.3,92.5,92.7,92.2]
[45,95.1,95.6,94.9,94,94.2,93.7,92.9,93.1,92.7]
[55,95.4,95.8,95.2,94.3,94.6,94.1,93.2,93.5,93.1]
[75,95.6,96,95.4,94.7,95,94.6,93.8,94,93.7]
[90,95.8,96.2,95.6,95,95.2,94.9,94.1,94.2,94]
[110,96,96.4,95.6,95.2,95.4,95.1,94.6,94.5,94.3]
[132,95,96.5,95.8,95.4,95.6,95.4,94.6,94.7,94.6]
[160,96.2,96.5,96,95.6,95.8,95.6,94.8,94.9,94.8]
[200,96.3,96.6,96.1,95.8,96,95.8,95,95.1,95]
[250,96.4,96.7,96.1,95.8,96,95.8,95,95.1,95]
[315,96.5,96.8,96.1,95.8,96,95.8,95,95.1,95]
[355,96.6,96.8,96.1,95.8,96,95.8,95,95.1,95]
[375,96.6,96.8,96.1,95.8,96,95.8,95,95.1,95]
[]
["Table B1. Polyphase Induction Motor Coefficients, VFD Driven (hp)"]
["HP","2 POLE",null,null,"4 POLE",null,null,"6 POLE",null,null,"8 POLE"]
[null,"a","b","c","a","b","c","a","b","c","a","b","c"]
[1,1.0290587089821184,1.7010581577560906E-2,{"$f":"1-(B124/(C124+1))","v":-1.1846609684108333E-2},1.0374399999999999,3.3369999999999997E-2,{"$f":"1-(E124/(F124+1))","v":-3.938569921712487E-3},1.0905912997124119,6.4569252594785076E-2,{"$f":"1-(H124/(I124+1))","v":-2.4443733514001531E-2},1.0905912997124119,6.4569252594785076E-2,{"$f":"1-(K124/(L124+1))","v":-2.4443733514001531E-2}]
[1.5,1.0299771331744125,1.6103178471842214E-2,{"$f":"1-(B125/(C125+1))","v":-1.3654080605707719E-2},1.0381199999999999,3.1196707536618764E-2,{"$f":"1-(E125/(F125+1))","v":-6.7138426769417503E-3},1.0848438439543235,5.9027745017881786E-2,{"$f":"1-(H125/(I125+1))","v":-2.437716958586944E-2},1.0848438439543235,5.9027745017881786E-2,{"$f":"1-(K125/(L125+1))","v":-2.437716958586944E-2}]
[2,1.0308955573667065,1.5195775366123527E-2,-1.5464782637536922E-2,1.0387999999999999,2.9020489849636892E-2,-9.5037078919508744E-3,1.0790963881962352,5.3486237440978489E-2,-2.4309905383734565E-2,1.0790963881962352,5.3486237440978489E-2,-2.4309905383734565E-2]
[3,1.0327324057512945,1.3380969154686151E-2,-1.9095914750353327E-2,1.04016,2.4668054475673148E-2,-1.5118989468500654E-2,1.0676014766800588,4.2403222287171902E-2,-2.4173231484835966E-2,1.0676014766800588,4.2403222287171902E-2,-2.4173231484835966E-2]
[5,1.0364061025204707,9.7513567318113972E-3,-2.6397335949050582E-2,1.04288,1.5963183727745658E-2,-2.6493889447343877E-2,1.0446116536477055,2.0237191979558734E-2,-2.3890975412152127E-2,1.0446116536477055,2.0237191979558734E-2,-2.3890975412152127E-2]
[7.5,1.0348922416940116,8.9161676043317383E-3,-2.5746513856904629E-2,1.04077,1.4463467280912556E-2,-2.5931473697714758E-2,1.042429389884002,1.7980813687747493E-2,-2.4016735745428175E-2,1.042429389884002,1.7980813687747493E-2,-2.4016735745428175E-2]
[10,1.0333783808675525,8.0809784768520795E-3,-2.5094613360251428E-2,1.0386599999999999,1.2963750834079454E-2,-2.5367392608829364E-2,1.0402471261202986,1.5724435395936251E-2,-2.4143054818606569E-2,1.0402471261202986,1.5724435395936251E-2,-2.4143054818606569E-2]
[15,1.0303506592146343,6.4106002218927618E-3,-2.3787566414208428E-2,1.03443,9.9643179404132511E-3,-2.4224303398637792E-2,1.0358825985928914,1.1211678812313771E-2,-2.4397384145675716E-2,1.0358825985928914,1.1211678812313771E-2,-2.4397384145675716E-2]
[20,1.0273229375617161,4.7402219669334441E-3,-2.2476173543220401E-2,1.0302100000000001,6.964885046747046E-3,-2.3084335212120166E-2,1.0315180710654845,6.6989222286912885E-3,-2.4653993650700645E-2,1.0315180710654845,6.6989222286912885E-3,-2.4653993650700645E-2]
[25,1.0265367998200667,4.7580121918819607E-3,-2.1675654599334182E-2,1.0288200000000001,6.4211833827768228E-3,-2.2255907354748361E-2,1.0297743857954778,6.2231264190406544E-3,-2.3405603347889326E-2,1.0297743857954778,6.2231264190406544E-3,-2.3405603347889326E-2]
[30,1.0257506620784176,4.7758024168304781E-3,-2.0875164002890356E-2,1.02742,5.8774817188066006E-3,-2.1416642357260374E-2,1.028030700525471,5.7473306093900204E-3,-2.2156031875897986E-2,1.028030700525471,5.7473306093900204E-3,-2.2156031875897986E-2]
[40,1.0241783865951188,4.8113828667275113E-3,-1.9274267846306925E-2,1.02464,4.7900783908661551E-3,-1.9755292210809738E-2,1.0245433299854576,4.7957389900887522E-3,-1.9653338712619206E-2,1.0245433299854576,4.7957389900887522E-3,-1.9653338712619206E-2]
[50,1.0226061111118203,4.8469633166245453E-3,-1.7673485061425964E-2,1.0218499999999999,3.7026750629257088E-3,-1.8080379168000649E-2,1.021055959445444,3.8441473707874836E-3,-1.7145900705539452E-2,1.021055959445444,3.8441473707874836E-3,-1.7145900705539452E-2]
[60,1.0222592723783495,4.4887785628977151E-3,-1.7691082463733965E-2,1.0209999999999999,3.4998956071213604E-3,-1.7439069470247537E-2,1.0205727134858866,3.98605499083111E-3,-1.6520805655221071E-2,1.0205727134858866,3.98605499083111E-3,-1.6520805655221071E-2]
[75,1.0217390142781433,3.9515014323074698E-3,-1.7717502110867756E-2,1.01972,3.1957264234148373E-3,-1.6471634738215446E-2,1.0198478445465504,4.1989164208965498E-3,-1.5583494335393855E-2,1.0198478445465504,4.1989164208965498E-3,-1.5583494335393855E-2]
[100,1.0208719174444665,3.0560395479903944E-3,-1.7761597751312586E-2,1.0175799999999999,2.6887777839039663E-3,-1.4851290396415751E-2,1.018639729647657,4.5536854710056156E-3,-1.4022191526824157E-2,1.018639729647657,4.5536854710056156E-3,-1.4022191526824157E-2]
[125,1.019970936000357,2.9929661760623523E-3,-1.6927306967090328E-2,1.01725,2.8575602516980924E-3,-1.4351429673312488E-2,1.019555448387369,4.5855543449009138E-3,-1.4901562119544964E-2,1.019555448387369,4.5855543449009138E-3,-1.4901562119544964E-2]
[150,1.0190699545562476,2.9298928041343103E-3,-1.6092911247252317E-2,1.01692,3.0263427194922184E-3,-1.3851737176551193E-2,1.0204711671270807,4.6174232187962119E-3,-1.5780876920777676E-2,1.0204711671270807,4.6174232187962119E-3,-1.5780876920777676E-2]
[200,1.0172679916680287,2.8037460602782262E-3,-1.4423804921527505E-2,1.0162599999999999,3.3600000000000001E-3,-1.285680114814225E-2,1.0223026046065045,4.6811609665868082E-3,-1.7539339170015156E-2,1.0223026046065045,4.6811609665868082E-3,-1.7539339170015156E-2]
[250,1.0172679916680287,2.8037460602782262E-3,-1.4423804921527505E-2,1.0162599999999999,3.3600000000000001E-3,-1.285680114814225E-2,1.0223026046065045,4.6811609665868082E-3,-1.7539339170015156E-2,1.0223026046065045,4.6811609665868082E-3,-1.7539339170015156E-2]
[300,1.0172679916680287,2.8037460602782262E-3,-1.4423804921527505E-2,1.0162599999999999,3.3600000000000001E-3,-1.285680114814225E-2,1.0223026046065045,4.6811609665868082E-3,-1.7539339170015156E-2,1.0223026046065045,4.6811609665868082E-3,-1.7539339170015156E-2]
[350,1.0172679916680287,2.8037460602782262E-3,-1.4423804921527505E-2,1.0162599999999999,3.3600000000000001E-3,-1.285680114814225E-2,1.0223026046065045,4.6811609665868082E-3,-1.7539339170015156E-2,1.0223026046065045,4.6811609665868082E-3,-1.7539339170015156E-2]
[400,1.0172679916680287,2.8037460602782262E-3,-1.4423804921527505E-2,1.0162599999999999,3.3600000000000001E-3,-1.285680114814225E-2,1.0223026046065045,4.6811609665868082E-3,-1.7539339170015156E-2,1.0223026046065045,4.6811609665868082E-3,-1.7539339170015156E-2]
[450,1.0172679916680287,2.8037460602782262E-3,-1.4423804921527505E-2,1.0162599999999999,3.3600000000000001E-3,-1.285680114814225E-2,1.0223026046065045,4.6811609665868082E-3,-1.7539339170015156E-2,1.0223026046065045,4.6811609665868082E-3,-1.7539339170015156E-2]
[500,1.0172679916680287,2.8037460602782262E-3,-1.4423804921527505E-2,1.0162599999999999,3.3600000000000001E-3,-1.285680114814225E-2,1.0223026046065045,4.6811609665868082E-3,-1.7539339170015156E-2,1.0223026046065045,4.6811609665868082E-3,-1.7539339170015156E-2]
[]
["Table B2. Polyphase Induction Motor Coefficients, VFD Driven (kW)"]
["kW","2 POLE",null,null,"4 POLE",null,null,"6 POLE",null,null,"8 POLE"]
[null,"a","b","c","a","b","c","a","b","c","a","b","c"]
[1,1.0296841238476484,1.6392671687875792E-2,{"$f":"1-(B153/(C153+1))","v":-1.3077083818107571E-2},1.0379070376490189,3.1890996825495017E-2,{"$f":"1-(E153/(F153+1))","v":-5.8301127173623346E-3},1.0866774826546253,6.0795679070566752E-2,{"$f":"1-(H153/(I153+1))","v":-2.439848134254774E-2},1.0866774826546253,6.0795679070566752E-2,{"$f":"1-(K153/(L153+1))","v":-2.439848134254774E-2}]
[1.1000000000000001,1.0299303501726602,1.614940007776354E-2,{"$f":"1-(B154/(C154+1))","v":-1.3561933012844474E-2},1.0380892170512896,3.1307560448288078E-2,{"$f":"1-(E154/(F154+1))","v":-6.5757848221861259E-3},1.0851366097972288,5.9310020202764255E-2,{"$f":"1-(H154/(I154+1))","v":-2.4380577075558074E-2},1.0851366097972288,5.9310020202764255E-2,{"$f":"1-(K154/(L154+1))","v":-2.4380577075558074E-2}]
[1.5,1.0309152554727075,1.5176313637314547E-2,-1.5503653526943717E-2,1.0388179346603734,2.8973814939460336E-2,-9.5669292823474805E-3,1.0789731183676434,5.3367384731554286E-2,-2.4308454967603366E-2,1.0789731183676434,5.3367384731554286E-2,-2.4308454967603366E-2]
[2.2000000000000002,1.0326388397477901,1.3473412366528804E-2,-1.8910636576551898E-2,1.0400931904762694,2.4889760299011784E-2,-1.4834210240155077E-2,1.0681870083658693,4.2967772656936846E-2,-2.4180263638143851E-2,1.0681870083658693,4.2967772656936846E-2,-2.4180263638143851E-2]
[3,1.0346086503478846,1.1527239485630815E-2,-2.2818377954894276E-2,1.0415506256944365,2.0222269281356293E-2,-2.0905597785180419E-2,1.0558600255066988,3.1082501714516916E-2,-2.4030592848759413E-2,1.0558600255066988,3.1082501714516916E-2,-2.4030592848759413E-2]
[3.7,1.0363322346229671,9.8243382148450707E-3,-2.62500074567249E-2,1.0428258815103326,1.6138214640907738E-2,-2.6263815773188037E-2,1.0450739155049245,2.068288963989948E-2,-2.3896771575773412E-2,1.0450739155049245,2.068288963989948E-2,-2.3896771575773412E-2]
[4,1.0361869376823238,9.6304446329269419E-3,-2.6303181714228296E-2,1.0425747616043206,1.5746066601394486E-2,-2.6412797336929694E-2,1.0442957227006813,1.9910531315328689E-2,-2.3909147554250776E-2,1.0442957227006813,1.9910531315328689E-2,-2.3909147554250776E-2]
[5.5,1.0349693552481745,8.9587107502355282E-3,-2.5779691696796947E-2,1.040876018678246,1.4539860343887968E-2,-2.5958722139740376E-2,1.0425405507727699,1.8095749847383991E-2,-2.4010316248791241E-2,1.0425405507727699,1.8095749847383991E-2,-2.4010316248791241E-2]
[7.5,1.0333459120026418,8.0630655733136426E-3,-2.5080619747683386E-2,1.0386110281101464,1.2931585333879281E-2,-2.5351606315842989E-2,1.0402003215355542,1.5676041223457726E-2,-2.4145770222713026E-2,1.0402003215355542,1.5676041223457726E-2,-2.4145770222713026E-2]
[11,1.03050488632296,6.4956865137003406E-3,-2.3854250078728878E-2,1.0346472946159726,1.0117104066364076E-2,-2.4284501718522478E-2,1.0361049203704269,1.1441551131586767E-2,-2.4384374174906132E-2,1.0361049203704269,1.1441551131586767E-2,-2.4384374174906132E-2]
[15,1.0273060766986244,4.7406035267178624E-3,-2.2459003938628541E-2,1.0301780444544386,6.9532238850533151E-3,-2.306444829659382E-2,1.0314806729899884,6.6887174928274683E-3,-2.462723090699348E-2,1.0314806729899884,6.6887174928274683E-3,-2.462723090699348E-2]
[18.5,1.0265684139383637,4.7572967672861758E-3,-2.1707846503083772E-2,1.0288712911018636,6.4430480609525692E-3,-2.2284661893310354E-2,1.029844507187033,6.242260298785318E-3,-2.3455829495016012E-2,1.029844507187033,6.242260298785318E-3,-2.3455829495016012E-2]
[22,1.0258307511781031,4.7739900078544902E-3,-2.0956714026886702E-2,1.0275645377492888,5.9328722368518242E-3,-2.1504084526371425E-2,1.0282083413840775,5.7958031047431677E-3,-2.2283388149115568E-2,1.0282083413840775,5.7958031047431677E-3,-2.2283388149115568E-2]
[30,1.0241446648689354,4.8121459862963487E-3,-1.923993351380382E-2,1.0245776729434031,4.7667560674786924E-3,-1.9716931075090205E-2,1.0244685338344655,4.775329518361111E-3,-1.9599609721254074E-2,1.0244685338344655,4.775329518361111E-3,-1.9599609721254074E-2]
[37,1.0226693393484141,4.8455324674329756E-3,-1.7737857516482158E-2,1.0219641662382533,3.7464044192772007E-3,-1.814976545745739E-2,1.0211962022285546,3.8824151302768103E-3,-1.7246827753259364E-2,1.0211962022285546,3.8824151302768103E-3,-1.7246827753259364E-2]
[45,1.0222481140276749,4.4772551928046267E-3,-1.7691648808373595E-2,1.0209706961051401,3.493371871277789E-3,-1.741648198559731E-2,1.0205571666989839,3.9906203834330495E-3,-1.6500698292603477E-2,1.0205571666989839,3.9906203834330495E-3,-1.6500698292603477E-2]
[55,1.0217831827495638,3.9971147722592778E-3,-1.771525805762808E-2,1.019825939348137,3.2215495444623079E-3,-1.6551069712581912E-2,1.0199093839113733,4.1808450751805388E-3,-1.5663054033872914E-2,1.0199093839113733,4.1808450751805388E-3,-1.5663054033872914E-2]
[75,1.0208525934456651,3.0546867678954231E-3,-1.7743705216232364E-2,1.0175751148553083,2.6923977832132239E-3,-1.4842754472855546E-2,1.0186593697278654,4.5543689857272304E-3,-1.4041052607615123E-2,1.0186593697278654,4.5543689857272304E-3,-1.4041052607615123E-2]
[90,1.0201279434906174,3.0039575143339949E-3,-1.7072700309897604E-2,1.0173088180139649,2.8281477573103759E-3,-1.4439832277383324E-2,1.0193958727356767,4.5800007877877923E-3,-1.474832460955855E-2,1.0193958727356767,4.5800007877877923E-3,-1.474832460955855E-2]
[110,1.0191617435505536,2.9363185095854245E-3,-1.6177921510589943E-2,1.0169537555588406,3.009147722773246E-3,-1.390277234033932E-2,1.0203778767460914,4.6141765238685408E-3,-1.5691297804265369E-2,1.0203778767460914,4.6141765238685408E-3,-1.5691297804265369E-2]
[132,1.0180989236164835,2.8619156043619967E-3,-1.51935254246236E-2,1.0165631868582039,3.2082476847824027E-3,-1.33122302415698E-2,1.0214580811575478,4.6517698335573647E-3,-1.6728494219220735E-2,1.0214580811575478,4.6517698335573647E-3,-1.6728494219220735E-2]
[150,1.0172679916680287,2.8037460602782262E-3,-1.4423804921527505E-2,1.0162578331467969,3.3639076550804705E-3,-1.2850696933927264E-2,1.0223026046065045,4.6811609665868082E-3,-1.7539339170015156E-2,1.0223026046065045,4.6811609665868082E-3,-1.7539339170015156E-2]
[160,1.0172679916680287,2.8037460602782262E-3,-1.4423804921527505E-2,1.0162578331467969,3.3639076550804705E-3,-1.2850696933927264E-2,1.0223026046065045,4.6811609665868082E-3,-1.7539339170015156E-2,1.0223026046065045,4.6811609665868082E-3,-1.7539339170015156E-2]
[185,1.0172679916680287,2.8037460602782262E-3,-1.4423804921527505E-2,1.0162578331467969,3.3639076550804705E-3,-1.2850696933927264E-2,1.0223026046065045,4.6811609665868082E-3,-1.7539339170015156E-2,1.0223026046065045,4.6811609665868082E-3,-1.7539339170015156E-2]
[200,1.0172679916680287,2.8037460602782262E-3,-1.4423804921527505E-2,1.0162578331467969,3.3639076550804705E-3,-1.2850696933927264E-2,1.0223026046065045,4.6811609665868082E-3,-1.7539339170015156E-2,1.0223026046065045,4.6811609665868082E-3,-1.7539339170015156E-2]
[220,1.0172679916680287,2.8037460602782262E-3,-1.4423804921527505E-2,1.0162578331467969,3.3639076550804705E-3,-1.2850696933927264E-2,1.0223026046065045,4.6811609665868082E-3,-1.7539339170015156E-2,1.0223026046065045,4.6811609665868082E-3,-1.7539339170015156E-2]
[250,1.0172679916680287,2.8037460602782262E-3,-1.4423804921527505E-2,1.0162578331467969,3.3639076550804705E-3,-1.2850696933927264E-2,1.0223026046065045,4.6811609665868082E-3,-1.7539339170015156E-2,1.0223026046065045,4.6811609665868082E-3,-1.7539339170015156E-2]
[300,1.0172679916680287,2.8037460602782262E-3,-1.4423804921527505E-2,1.0162578331467969,3.3639076550804705E-3,-1.2850696933927264E-2,1.0223026046065045,4.6811609665868082E-3,-1.7539339170015156E-2,1.0223026046065045,4.6811609665868082E-3,-1.7539339170015156E-2]
[330,1.0172679916680287,2.8037460602782262E-3,-1.4423804921527505E-2,1.0162578331467969,3.3639076550804705E-3,-1.2850696933927264E-2,1.0223026046065045,4.6811609665868082E-3,-1.7539339170015156E-2,1.0223026046065045,4.6811609665868082E-3,-1.7539339170015156E-2]
[375,1.0172679916680287,2.8037460602782262E-3,-1.4423804921527505E-2,1.0162578331467969,3.3639076550804705E-3,-1.2850696933927264E-2,1.0223026046065045,4.6811609665868082E-3,-1.7539339170015156E-2,1.0223026046065045,4.6811609665868082E-3,-1.7539339170015156E-2]
[]
["Table C1. VFD Performance Coefficienct (hp capacity)"]
["HP","d","e","f"]
[1,0.98029999999999995,0.04,-1.3100000000000001E-2]
[1.5,0.97994999999999999,3.8550000000000001E-2,-1.1800000000000001E-2]
[2,0.97960000000000003,3.7100000000000001E-2,-1.0500000000000001E-2]
[3,0.97889999999999999,3.4200000000000001E-2,-7.9000000000000008E-3]
[5,0.97750000000000004,2.8400000000000002E-2,-2.7000000000000001E-3]
[7.5,0.97809999999999997,2.5300000000000003E-2,-4.0000000000000007E-4]
[10,0.97870000000000001,2.2200000000000001E-2,1.9E-3]
[15,0.98185,1.985E-2,6.9999999999999999E-4]
[20,0.98499999999999999,1.7500000000000002E-2,-5.0000000000000001E-4]
[25,0.98619999999999997,1.6500000000000001E-2,-3.1999999999999997E-3]
[30,0.98740000000000006,1.55E-2,-5.8999999999999999E-3]
[40,0.98765000000000003,1.695E-2,-3.8E-3]
[50,0.9879,1.84E-2,-1.6999999999999999E-3]
[60,0.97189999999999999,1.4500000000000001E-2,1.18E-2]
[75,0.9919,1.7899999999999999E-2,-1.2999999999999999E-3]
[100,0.98240000000000005,1.26E-2,1.4E-3]
[125,0.98292500000000005,1.1900000000000001E-2,-1.0000000000000005E-4]
[150,0.98345000000000005,1.12E-2,-1.6000000000000001E-3]
[200,0.98450000000000004,9.7999999999999997E-3,-4.5999999999999999E-3]
[250,0.98450000000000004,9.7999999999999997E-3,-4.5999999999999999E-3]
[300,0.98450000000000004,9.7999999999999997E-3,-4.5999999999999999E-3]
[350,0.98450000000000004,9.7999999999999997E-3,-4.5999999999999999E-3]
[400,0.98450000000000004,9.7999999999999997E-3,-4.5999999999999999E-3]
[450,0.98450000000000004,9.7999999999999997E-3,-4.5999999999999999E-3]
[500,0.98450000000000004,9.7999999999999997E-3,-4.5999999999999999E-3]
[]
["Table C2. VFD Performance Coefficients (kW capacity)"]
["kW","d","e","f"]
[1,0.98006166219839141,3.9012600536193029E-2,-1.2214745308310994E-2]
[1.1000000000000001,0.9799678284182306,3.8623860589812334E-2,-1.1866219839142092E-2]
[1.5,0.97959249329758713,3.7068900804289547E-2,-1.0472117962466488E-2]
[2.2000000000000002,0.97893565683646111,3.4347721179624667E-2,-8.0324396782841829E-3]
[3,0.97818498659517428,3.1237801608579089E-2,-5.2442359249329764E-3]
[3.7,0.97752815013404826,2.8516621983914209E-2,-2.8045576407506696E-3]
[4,0.97758686327077748,2.7951206434316356E-2,-2.3670241286863273E-3]
[5.5,0.97806943699731896,2.545790884718499E-2,-5.1715817694369948E-4]
[7.5,0.97873378016085788,2.2174798927613943E-2,1.8871313672922253E-3]
[11,0.98168954423592492,1.9969705093833778E-2,7.6112600536193007E-4]
[15,0.98502573726541554,1.7478552278820378E-2,-5.5790884718498663E-4]
[18.5,0.98615174262734584,1.6540214477211795E-2,-3.0914209115281508E-3]
[22,0.98727774798927614,1.5601876675603216E-2,-5.6249329758713143E-3]
[30,0.98765536193029491,1.6981099195710454E-2,-3.7549597855227883E-3]
[37,0.98788994638069705,1.8341689008042894E-2,-1.784450402144771E-3]
[45,0.97232895442359246,1.4572922252010725E-2,1.1519034852546914E-2]
[55,0.9902020554066131,1.7611349419124216E-2,-1.8784629133154415E-4]
[75,0.98241126005361934,1.2584986595174263E-2,1.3678284182305626E-3]
[90,0.98283351206434322,1.2021983914209116E-2,1.6139410187667553E-4]
[110,0.98339651474530831,1.1271313672922252E-2,-1.4471849865951741E-3]
[132,0.98401581769436997,1.0445576407506702E-2,-3.2166219839142095E-3]
[150,0.98450000000000004,9.7999999999999997E-3,-4.5999999999999999E-3]
[160,0.98450000000000004,9.7999999999999997E-3,-4.5999999999999999E-3]
[185,0.98450000000000004,9.7999999999999997E-3,-4.5999999999999999E-3]
[200,0.98450000000000004,9.7999999999999997E-3,-4.5999999999999999E-3]
[220,0.98450000000000004,9.7999999999999997E-3,-4.5999999999999999E-3]
[250,0.98450000000000004,9.7999999999999997E-3,-4.5999999999999999E-3]
[300,0.98450000000000004,9.7999999999999997E-3,-4.5999999999999999E-3]
[330,0.98450000000000004,9.7999999999999997E-3,-4.5999999999999999E-3]
[375,0.98450000000000004,9.7999999999999997E-3,-4.5999999999999999E-3]
[]
["Table D1. Polyphase Induction Motor Coefficients, DOL (hp)"]
["HP","2 POLE",null,null,"4 POLE",null,null,"6 POLE",null,null,"8 POLE"]
[null,"a","b","c","a","b","c","a","b","c","a","b","c"]
[1,1.1346000000000001,8.6738167906186978E-2,{"$f":"1-(B248/(C248+1))","v":-4.4041732872995842E-2},1.12541,9.1318214383920848E-2,{"$f":"1-(E248/(F248+1))","v":-3.1239087890899908E-2},1.1687285620318451,0.11466243314166571,{"$f":"1-(H248/(I248+1))","v":-4.8504486454965967E-2},1.1687285620318451,0.11466243314166571,{"$f":"1-(K248/(L248+1))","v":-4.8504486454965967E-2}]
[1.5,1.2931999999999999,8.1142483629434187E-2,{"$f":"1-(B249/(C249+1))","v":-0.19614206229199427},1.1206700000000001,8.4915245233653375E-2,{"$f":"1-(E249/(F249+1))","v":-3.2956265407300345E-2},1.158950925043136,0.10606458738136698,{"$f":"1-(H249/(I249+1))","v":-4.7814872897231631E-2},1.158950925043136,0.10606458738136698,{"$f":"1-(K249/(L249+1))","v":-4.7814872897231631E-2}]
[2,1.1240499704558535,7.5546799352681396E-2,-4.50962906796466E-2,1.11592,7.8512276083385901E-2,-3.4684560153974475E-2,1.149173288054427,9.7466741621068248E-2,-4.711445410817916E-2,1.149173288054427,9.7466741621068248E-2,-4.711445410817916E-2]
[3,1.1135030046530503,6.4355430799175814E-2,-4.6175903680006458E-2,1.10643,6.570633778285094E-2,-3.8212836663684246E-2,1.1296180140770089,8.0271050100470781E-2,-4.568016885387105E-2,1.1296180140770089,8.0271050100470781E-2,-4.568016885387105E-2]
[5,1.0924090730474438,4.197269369216465E-2,-4.8404703559515427E-2,1.08745,4.009446118178104E-2,-4.5530036535732066E-2,1.0905074661221728,4.5879667059275833E-2,-4.2670108683131813E-2,1.0905074661221728,4.5879667059275833E-2,-4.2670108683131813E-2]
[7.5,1.0888348126879779,3.989909103363961E-2,-4.7058144464475982E-2,1.0833999999999999,3.7453687604279112E-2,-4.4287579238184271E-2,1.0857869917956742,4.2170186849640849E-2,-4.1851902401738972E-2,1.0857869917956742,4.2170186849640849E-2,-4.1851902401738972E-2]
[10,1.0852605523285119,3.7825488375114562E-2,-4.5706204448365151E-2,1.0712699999999999,3.4812914026777178E-2,-3.5230605918278535E-2,1.0810665174691756,3.8460706640005858E-2,-4.1027850699351998E-2,1.0810665174691756,3.8460706640005858E-2,-4.1027850699351998E-2]
[15,1.0781120316095798,3.367828305806448E-2,-4.2986052120647544E-2,1.06318,2.953136687177332E-2,-3.2683446285340256E-2,1.0716255688161782,3.104174622073589E-2,-3.9361958663848062E-2,1.0716255688161782,3.104174622073589E-2,-3.9361958663848062E-2]
[20,1.0709635108906479,2.9531077741014392E-2,-4.0243984902858854E-2,1.06033,2.4249819716769459E-2,-3.522595717244803E-2,1.062184620163181,2.3622785801465915E-2,-3.7671918695637796E-2,1.062184620163181,2.3622785801465915E-2,-3.7671918695637796E-2]
[25,1.0694923844806872,2.9225034973615917E-2,-3.9123950680138186E-2,1.05749,2.2909351548753371E-2,-3.3806170995396068E-2,1.0596586949335201,2.2571605445197398E-2,-3.6268452293055864E-2,1.0596586949335201,2.2571605445197398E-2,-3.6268452293055864E-2]
[30,1.0680212580707267,2.891899220621744E-2,-3.8003250169059255E-2,1.0518000000000001,2.1568883380737286E-2,-2.9592832271101654E-2,1.0571327697038591,2.1520425088928884E-2,-3.4862097458139285E-2,1.0571327697038591,2.1520425088928884E-2,-3.4862097458139285E-2]
[40,1.0650790052508055,2.8306906671420492E-2,-3.57598479022323E-2,1.0461199999999999,1.8887947044705113E-2,-2.6727230442053607E-2,1.0520809192445368,1.9418064376391854E-2,-3.2040686750166358E-2,1.0520809192445368,1.9418064376391854E-2,-3.2040686750166358E-2]
[50,1.0621367524308842,2.769482113662354E-2,-3.3513773336103947E-2,1.04436,1.6207010708672941E-2,-2.7703990421886537E-2,1.0470290687852148,1.731570366385482E-2,-2.9207614720138109E-2,1.0470290687852148,1.731570366385482E-2,-2.9207614720138109E-2]
[60,1.0594575801250499,2.5853313010673128E-2,-3.2757380307867789E-2,1.04172,1.5562180379877466E-2,-2.5756984776981184E-2,1.0455305615221844,1.6912207553272079E-2,-2.8142403794885196E-2,1.0455305615221844,1.6912207553272079E-2,-2.8142403794885196E-2]
[75,1.0554388216662982,2.3091050821747512E-2,-3.161768526718034E-2,1.03732,1.4594934886684254E-2,-2.2398165348473498E-2,1.0432828006276385,1.6306963387397969E-2,-2.6543001486803552E-2,1.0432828006276385,1.6306963387397969E-2,-2.6543001486803552E-2]
[100,1.048740890901712,1.8487280506871488E-2,-2.9704455788376771E-2,1.03731,1.2982859064695568E-2,-2.4015352992019956E-2,1.0395365324700621,1.5298223110941117E-2,-2.3873093449186866E-2,1.0395365324700621,1.5298223110941117E-2,-2.3873093449186866E-2]
[125,1.0471342740742975,1.8133773438124362E-2,-2.8483978621239192E-2,1.03729,1.3317880069511831E-2,-2.3657058068336623E-2,1.0394796360934762,1.4627796595180455E-2,-2.4493552790187501E-2,1.0394796360934762,1.4627796595180455E-2,-2.4493552790187501E-2]
[150,1.045527657246883,1.7780266369377233E-2,-2.7262653633957967E-2,1.0372600000000001,1.3652901074328096E-2,-2.3289134673863066E-2,1.0394227397168905,1.3957370079419794E-2,-2.5114832624054007E-2,1.0394227397168905,1.3957370079419794E-2,-2.5114832624054007E-2]
[200,1.0423144235920543,1.7073252231882982E-2,-2.4817456662813209E-2,1.0372600000000001,1.4322943083960624E-2,-2.2613169772440767E-2,1.0393089469637187,1.2616517047898472E-2,-2.6359860289102421E-2,1.0393089469637187,1.2616517047898472E-2,-2.6359860289102421E-2]
[250,1.0423144235920543,1.7073252231882982E-2,-2.4817456662813209E-2,1.0372600000000001,1.4322943083960624E-2,-2.2613169772440767E-2,1.0393089469637187,1.2616517047898472E-2,-2.6359860289102421E-2,1.0393089469637187,1.2616517047898472E-2,-2.6359860289102421E-2]
[300,1.0423144235920543,1.7073252231882982E-2,-2.4817456662813209E-2,1.0372600000000001,1.4322943083960624E-2,-2.2613169772440767E-2,1.0393089469637187,1.2616517047898472E-2,-2.6359860289102421E-2,1.0393089469637187,1.2616517047898472E-2,-2.6359860289102421E-2]
[350,1.0423144235920543,1.7073252231882982E-2,-2.4817456662813209E-2,1.0372600000000001,1.4322943083960624E-2,-2.2613169772440767E-2,1.0393089469637187,1.2616517047898472E-2,-2.6359860289102421E-2,1.0393089469637187,1.2616517047898472E-2,-2.6359860289102421E-2]
[400,1.0423144235920543,1.7073252231882982E-2,-2.4817456662813209E-2,1.0372600000000001,1.4322943083960624E-2,-2.2613169772440767E-2,1.0393089469637187,1.2616517047898472E-2,-2.6359860289102421E-2,1.0393089469637187,1.2616517047898472E-2,-2.6359860289102421E-2]
[450,1.0423144235920543,1.7073252231882982E-2,-2.4817456662813209E-2,1.0372600000000001,1.4322943083960624E-2,-2.2613169772440767E-2,1.0393089469637187,1.2616517047898472E-2,-2.6359860289102421E-2,1.0393089469637187,1.2616517047898472E-2,-2.6359860289102421E-2]
[500,1.0423144235920543,1.7073252231882982E-2,-2.4817456662813209E-2,1.0372600000000001,1.4322943083960624E-2,-2.2613169772440767E-2,1.0393089469637187,1.2616517047898472E-2,-2.6359860289102421E-2,1.0393089469637187,1.2616517047898472E-2,-2.6359860289102421E-2]
[]
["Table D2. Polyphase Induction Motor Coefficients, DOL (kW)"]
["kW","2 POLE",null,null,null,null,"6 POLE",null,null,"8 POLE"]
[null,"a","b","c","b","c","a","b","c","a","b","c"]
[1,1.1310058781971124,8.2927701937567114E-2,{"$f":"1-(B277/(C277+1))","v":-4.4396478336941714E-2},8.6958015552371412E-2,{"$f":"1-(#REF!/(E277+1))","v":{"$error":"#REF!"}},1.1620703320180861,0.10880759983572502,{"$f":"1-(G277/(H277+1))","v":-4.803604537906514E-2},1.1620703320180861,0.10880759983572502,{"$f":"1-(J277/(K277+1))","v":-4.803604537906514E-2}]
[1.1000000000000001,1.1295920758106777,8.1427518485354566E-2,{"$f":"1-(B278/(C278+1))","v":-4.4537943137217706E-2},8.5241401839162984E-2,{"$f":"1-(#REF!/(E278+1))","v":{"$error":"#REF!"}},1.1594489816189684,0.1065025473530712,{"$f":"1-(G278/(H278+1))","v":-4.7850259714768306E-2},1.1594489816189684,0.1065025473530712,{"$f":"1-(J278/(K278+1))","v":-4.7850259714768306E-2}]
[1.5,1.1239368662649387,7.5426784676504391E-2,-4.5107749109137618E-2,7.8374946986329228E-2,{"$f":"1-(#REF!/(E279+1))","v":{"$error":"#REF!"}},1.1489635800224975,9.7282337422455942E-2,-4.7099311487545092E-2,1.1489635800224975,9.7282337422455942E-2,-4.7099311487545092E-2]
[2.2000000000000002,1.1140402495598956,6.4925500511016573E-2,-4.6120361495062934E-2,6.6358650993870144E-2,{"$f":"1-(#REF!/(E280+1))","v":{"$error":"#REF!"}},1.1306141272286736,8.1146970043879219E-2,-4.5754331793379288E-2,1.1306141272286736,8.1146970043879219E-2,-4.5754331793379288E-2]
[3,1.1027298304684174,5.2924032893316222E-2,-4.7302365621041398E-2,5.2625741288202639E-2,{"$f":"1-(#REF!/(E281+1))","v":{"$error":"#REF!"}},1.109643324035732,6.2706550182648702E-2,-4.4167201044367443E-2,1.109643324035732,6.2706550182648702E-2,-4.4167201044367443E-2]
[3.7,1.0928332137633743,4.2422748727828412E-2,-4.8358945636083561E-2,4.0609445295743563E-2,{"$f":"1-(#REF!/(E282+1))","v":{"$error":"#REF!"}},1.091293871241908,4.6571182804071971E-2,-4.2732581569856265E-2,1.091293871241908,4.6571182804071971E-2,-4.2732581569856265E-2]
[4,1.0918916198050546,4.1672493843477376E-2,-4.8210091231537522E-2,3.9712150797906763E-2,{"$f":"1-(#REF!/(E283+1))","v":{"$error":"#REF!"}},1.0898240730561382,4.5342637752787122E-2,-4.2552014714500208E-2,1.0898240730561382,4.5342637752787122E-2,-4.2552014714500208E-2]
[5.5,1.0890168795695592,4.0004716906325871E-2,-4.7126865740598323E-2,3.7588204220827467E-2,{"$f":"1-(#REF!/(E284+1))","v":{"$error":"#REF!"}},1.0860274449115013,4.235914160562762E-2,-4.1893721235665371E-2,1.0860274449115013,4.235914160562762E-2,-4.1893721235665371E-2]
[7.5,1.0851838925888988,3.7781014323457186E-2,-4.5677149235905157E-2,3.4756275451388395E-2,{"$f":"1-(#REF!/(E285+1))","v":{"$error":"#REF!"}},1.0809652740519853,3.8381146742748271E-2,-4.1010112175878133E-2,1.0809652740519853,3.8381146742748271E-2,-4.1010112175878133E-2]
[11,1.0784761653727426,3.3889534803437003E-2,-4.3125139648291899E-2,2.9800400104870031E-2,{"$f":"1-(#REF!/(E286+1))","v":{"$error":"#REF!"}},1.0721064750478322,3.1419655732709426E-2,-3.9447395721986078E-2,1.0721064750478322,3.1419655732709426E-2,-3.9447395721986078E-2]
[15,1.0709319585815871,2.952451382107019E-2,-4.0219969708961578E-2,2.4221069729251688E-2,{"$f":"1-(#REF!/(E287+1))","v":{"$error":"#REF!"}},1.0621304448231348,2.360024037827517E-2,-3.7641847788762339E-2,1.0621304448231348,2.360024037827517E-2,-3.7641847788762339E-2]
[18.5,1.0695515450601762,2.9237342323511297E-2,-3.9169005125343936E-2,2.2963257775349192E-2,{"$f":"1-(#REF!/(E288+1))","v":{"$error":"#REF!"}},1.0597602736961069,2.2613878113680045E-2,-3.6324947643921579E-2,1.0597602736961069,2.2613878113680045E-2,-3.6324947643921579E-2]
[22,1.0681711315387656,2.8950170825952404E-2,-3.811745391064969E-2,2.1705445821446699E-2,{"$f":"1-(#REF!/(E289+1))","v":{"$error":"#REF!"}},1.0573901025690793,2.1627515849084927E-2,-3.5005504614146865E-2,1.0573901025690793,2.1627515849084927E-2,-3.5005504614146865E-2]
[30,1.0650159006326838,2.8293778831532085E-2,-3.571170278096969E-2,1.8830447069669572E-2,{"$f":"1-(#REF!/(E290+1))","v":{"$error":"#REF!"}},1.0519725685644441,1.9372973530010364E-2,-3.1980046441239196E-2,1.0519725685644441,1.9372973530010364E-2,-3.1980046441239196E-2]
[37,1.0622550735898624,2.7719435836414303E-2,-3.3604149682487039E-2,1.6314823161864583E-2,{"$f":"1-(#REF!/(E291+1))","v":{"$error":"#REF!"}},1.0472322263103886,1.7400249000820114E-2,-2.9321771189722234E-2,1.0472322263103886,1.7400249000820114E-2,-2.9321771189722234E-2]
[45,1.0593713869141383,2.5794068781420033E-2,-3.2733000857185779E-2,1.5541435168227209E-2,{"$f":"1-(#REF!/(E292+1))","v":{"$error":"#REF!"}},1.0454823521732397,1.6899226445156817E-2,-2.8108120239212608E-2,1.0454823521732397,1.6899226445156817E-2,-2.8108120239212608E-2]
[55,1.0557800031261564,2.3325559229207687E-2,-3.1714681221677088E-2,1.467705134946652E-2,{"$f":"1-(#REF!/(E293+1))","v":{"$error":"#REF!"}},1.0434736293005444,1.6358346940354217E-2,-2.6678860307309815E-2,1.0434736293005444,1.6358346940354217E-2,-2.6678860307309815E-2]
[75,1.0487064326319551,1.8479698585825974E-2,-2.9678288225184479E-2,1.2990044501796185E-2,{"$f":"1-(#REF!/(E294+1))","v":{"$error":"#REF!"}},1.0395353121724409,1.5283843989959654E-2,-2.3886392289249381E-2,1.0395353121724409,1.5283843989959654E-2,-2.3886392289249381E-2]
[90,1.0474142475160721,1.8195376546619169E-2,-2.8696723283652803E-2,1.3259498393069318E-2,{"$f":"1-(#REF!/(E295+1))","v":{"$error":"#REF!"}},1.039489551011648,1.4744626953154833E-2,-2.4385370862018307E-2,1.039489551011648,1.4744626953154833E-2,-2.4385370862018307E-2]
[110,1.0456913340282281,1.7816280494343428E-2,-2.7387116975910564E-2,1.3618770248100166E-2,{"$f":"1-(#REF!/(E296+1))","v":{"$error":"#REF!"}},1.0394285361305908,1.4025670904081739E-2,-2.5051501116200026E-2,1.0394285361305908,1.4025670904081739E-2,-2.5051501116200026E-2]
[132,1.0437961291916,1.7399274836840117E-2,-2.5945422812487351E-2,1.4013969288634097E-2,{"$f":"1-(#REF!/(E297+1))","v":{"$error":"#REF!"}},1.0393614197614278,1.3234819250101334E-2,-2.5785336246797019E-2,1.0393614197614278,1.3234819250101334E-2,-2.5785336246797019E-2]
[150,1.0423144235920543,1.7073252231882982E-2,-2.4817456662813209E-2,1.4322943083960624E-2,{"$f":"1-(#REF!/(E298+1))","v":{"$error":"#REF!"}},1.0393089469637187,1.2616517047898472E-2,-2.6359860289102421E-2,1.0393089469637187,1.2616517047898472E-2,-2.6359860289102421E-2]
[160,1.0423144235920543,1.7073252231882982E-2,-2.4817456662813209E-2,1.4322943083960624E-2,{"$f":"1-(#REF!/(E299+1))","v":{"$error":"#REF!"}},1.0393089469637187,1.2616517047898472E-2,-2.6359860289102421E-2,1.0393089469637187,1.2616517047898472E-2,-2.6359860289102421E-2]
[185,1.0423144235920543,1.7073252231882982E-2,-2.4817456662813209E-2,1.4322943083960624E-2,{"$f":"1-(#REF!/(E300+1))","v":{"$error":"#REF!"}},1.0393089469637187,1.2616517047898472E-2,-2.6359860289102421E-2,1.0393089469637187,1.2616517047898472E-2,-2.6359860289102421E-2]
[200,1.0423144235920543,1.7073252231882982E-2,-2.4817456662813209E-2,1.4322943083960624E-2,{"$f":"1-(#REF!/(E301+1))","v":{"$error":"#REF!"}},1.0393089469637187,1.2616517047898472E-2,-2.6359860289102421E-2,1.0393089469637187,1.2616517047898472E-2,-2.6359860289102421E-2]
[220,1.0423144235920543,1.7073252231882982E-2,-2.4817456662813209E-2,1.4322943083960624E-2,{"$f":"1-(#REF!/(E302+1))","v":{"$error":"#REF!"}},1.0393089469637187,1.2616517047898472E-2,-2.6359860289102421E-2,1.0393089469637187,1.2616517047898472E-2,-2.6359860289102421E-2]
[250,1.0423144235920543,1.7073252231882982E-2,-2.4817456662813209E-2,1.4322943083960624E-2,{"$f":"1-(#REF!/(E303+1))","v":{"$error":"#REF!"}},1.0393089469637187,1.2616517047898472E-2,-2.6359860289102421E-2,1.0393089469637187,1.2616517047898472E-2,-2.6359860289102421E-2]
[300,1.0423144235920543,1.7073252231882982E-2,-2.4817456662813209E-2,1.4322943083960624E-2,{"$f":"1-(#REF!/(E304+1))","v":{"$error":"#REF!"}},1.0393089469637187,1.2616517047898472E-2,-2.6359860289102421E-2,1.0393089469637187,1.2616517047898472E-2,-2.6359860289102421E-2]
[]
[]
["10 CFR 431.25 TABLE 5 – NOMINAL FULL-LOAD EFFICIENCIES OF NEMA DESIGN A, NEMA DESIGN B AND IEC DESIGN N MOTORS (EXCLUDING FIRE PUMP ELECTRIC MOTORS) AT 60 HZ"]
[]
["Nominal Full Load Motor Effciency"]
["Motor Horsepower","4 pole"]
[null,"Enclosed","Open"]
[1,0.85499999999999998,0.85499999999999998]
[1.5,0.86499999999999999,0.86499999999999999]
[2,0.86499999999999999,0.86499999999999999]
[3,0.89500000000000002,0.89500000000000002]
[5,0.89500000000000002,0.89500000000000002]
[7.5,0.91700000000000004,0.91]
[10,0.91700000000000004,0.91700000000000004]
[15,0.92400000000000004,0.93]
[20,0.93,0.93]
[25,0.93599999999999994,0.93599999999999994]
[30,0.93599999999999994,0.94099999999999995]
[40,0.94099999999999995,0.94099999999999995]
[50,0.94499999999999995,0.94499999999999995]
[60,0.95,0.95]
[75,0.95400000000000007,0.95]
[100,0.95400000000000007,0.95400000000000007]
[125,0.95400000000000007,0.95400000000000007]
[150,0.95799999999999996,0.95799999999999996]
[200,0.96200000000000008,0.95799999999999996]
[250,0.96200000000000008,0.95799999999999996]
[300,0.96200000000000008,0.95799999999999996]
[350,0.96200000000000008,0.95799999999999996]
[400,0.96200000000000008,0.95799999999999996]
[450,0.96200000000000008,0.96200000000000008]
[500,0.96200000000000008,0.96200000000000008]
[]
["DOE Term Sheet: Appendix E—Air Over Motor (AO) Full Load efficiency "]
["Default Open AO Full Load Efficiency"]
["Motor Horsepower","Pole configurations"]
[null,2,4,6,8]
[1,0.72,0.755,0.7,0.7]
[1.5,0.8,0.77,0.77,0.72]
[2,0.81499999999999995,0.77,0.78500000000000003,0.82499999999999996]
[3,0.81499999999999995,0.81499999999999995,0.8,0.84]
[5,0.82499999999999996,0.81499999999999995,0.81499999999999995,0.85499999999999998]
[7.5,0.85499999999999998,0.86499999999999999,0.88500000000000001,0.88500000000000001]
[10,0.86499999999999999,0.875,0.90200000000000002,0.89500000000000002]
[15,0.875,0.89500000000000002,0.90200000000000002,0.89500000000000002]
[20,0.88500000000000001,0.89500000000000002,0.91,0.90200000000000002]
[25,0.89500000000000002,0.90200000000000002,0.91700000000000004,0.90200000000000002]
[30,0.89500000000000002,0.92400000000000004,0.92400000000000004,0.89500000000000002]
[40,0.90200000000000002,0.92400000000000004,0.93,0.89500000000000002]
[50,0.91,0.93,0.93,0.90200000000000002]
[60,0.91700000000000004,0.93599999999999994,0.93599999999999994,0.91]
[75,0.91700000000000004,0.93599999999999994,0.93599999999999994,0.92400000000000004]
[100,0.91700000000000004,0.94099999999999995,0.94099999999999995,0.92400000000000004]
[125,0.92400000000000004,0.94099999999999995,0.94099999999999995,0.92400000000000004]
[150,0.92400000000000004,0.94499999999999995,0.94499999999999995,0.92400000000000004]
[200,0.93599999999999994,0.94499999999999995,0.94499999999999995,0.92400000000000004]
[250,0.93599999999999994,0.94499999999999995,0.95,0.93599999999999994]
[]
["Default TEAO Full Load Efficiency"]
["Motor Horsepower","Pole configurations"]
[null,2,4,6,8]
[1,0.72,0.755,0.72,0.7]
[1.5,0.8,0.77,0.78500000000000003,0.74]
[2,0.81499999999999995,0.77,0.8,0.8]
[3,0.82499999999999996,0.81499999999999995,0.81499999999999995,0.81499999999999995]
[5,0.85499999999999998,0.81499999999999995,0.81499999999999995,0.82499999999999996]
[7.5,0.86499999999999999,0.875,0.89500000000000002,0.85499999999999998]
[10,0.875,0.875,0.89500000000000002,0.88500000000000001]
[15,0.88500000000000001,0.88500000000000001,0.90200000000000002,0.88500000000000001]
[20,0.88500000000000001,0.89500000000000002,0.90200000000000002,0.89500000000000002]
[25,0.89500000000000002,0.90200000000000002,0.91700000000000004,0.89500000000000002]
[30,0.89500000000000002,0.91700000000000004,0.91700000000000004,0.89500000000000002]
[40,0.90200000000000002,0.92400000000000004,0.93,0.89500000000000002]
[50,0.91,0.93,0.93,0.90200000000000002]
[60,0.91700000000000004,0.93599999999999994,0.93599999999999994,0.90200000000000002]
[75,0.91700000000000004,0.94099999999999995,0.93599999999999994,0.91700000000000004]
[100,0.92400000000000004,0.94099999999999995,0.94099999999999995,0.91700000000000004]
[125,0.93599999999999994,0.94099999999999995,0.94099999999999995,0.92400000000000004]
[150,0.93599999999999994,0.94499999999999995,0.95,0.92400000000000004]
[200,0.94099999999999995,0.95,0.95,0.93]
[250,0.94499999999999995,0.95,0.95,0.93599999999999994]
[]
[]
[" EISA 2007 Nominal ODP Motor Effciency"]
["Motor Horsepower","Pole Configuration"]
[null,2,4,6,8]
[1,0.77,0.85499999999999998,0.82499999999999996,0.755]
[1.5,0.84,0.86499999999999999,0.86499999999999999,0.77]
[2,0.85499999999999998,0.86499999999999999,0.875,0.86499999999999999]
[3,0.85499999999999998,0.89500000000000002,0.88500000000000001,0.875]
[5,0.86499999999999999,0.89500000000000002,0.89500000000000002,0.88500000000000001]
[7.5,0.88500000000000001,0.91,0.90200000000000002,0.89500000000000002]
[10,0.89500000000000002,0.91700000000000004,0.91700000000000004,0.90200000000000002]
[15,0.90200000000000002,0.93,0.91700000000000004,0.90200000000000002]
[20,0.91,0.93,0.92400000000000004,0.91]
[25,0.91700000000000004,0.93599999999999994,0.93,0.91]
[30,0.91700000000000004,0.94099999999999995,0.93599999999999994,0.91700000000000004]
[40,0.92400000000000004,0.94099999999999995,0.94099999999999995,0.91700000000000004]
[50,0.93,0.94499999999999995,0.94099999999999995,0.92400000000000004]
[60,0.93599999999999994,0.95,0.94499999999999995,0.93]
[75,0.93599999999999994,0.95,0.94499999999999995,0.94099999999999995]
[100,0.93599999999999994,0.95400000000000007,0.95,0.94099999999999995]
[125,0.94099999999999995,0.95400000000000007,0.95,0.94099999999999995]
[150,0.94099999999999995,0.95799999999999996,0.95400000000000007,0.94099999999999995]
[200,0.95,0.95799999999999996,0.95400000000000007,0.94099999999999995]
[250,0.95,0.95799999999999996,0.95400000000000007,0.95]
[300,0.95400000000000007,0.95799999999999996]
[350,0.95400000000000007,0.95799999999999996]
[400,0.95799999999999996,0.95799999999999996]
[450,0.95799999999999996,0.96200000000000008]
[500,0.95799999999999996,0.96200000000000008]
[]
[]
["EISA 2007 Nominal TEFC Motor Effciency"]
["Motor Horsepower","Pole Configuration"]
[null,2,4,6,8]
[1,0.77,0.85499999999999998,0.82499999999999996,0.72]
[1.5,0.84,0.86499999999999999,0.875,0.755]
[2,0.85499999999999998,0.86499999999999999,0.88500000000000001,0.81499999999999995]
[3,0.86499999999999999,0.89500000000000002,0.89500000000000002,0.82499999999999996]
[5,0.88500000000000001,0.89500000000000002,0.89500000000000002,0.84]
[7.5,0.89500000000000002,0.91700000000000004,0.91,0.84]
[10,0.90200000000000002,0.91700000000000004,0.91,0.875]
[15,0.91,0.92400000000000004,0.91700000000000004,0.875]
[20,0.91,0.93,0.91700000000000004,0.88500000000000001]
[25,0.91700000000000004,0.93599999999999994,0.93,0.88500000000000001]
[30,0.91700000000000004,0.93599999999999994,0.93,0.90200000000000002]
[40,0.92400000000000004,0.94099999999999995,0.94099999999999995,0.90200000000000002]
[50,0.93,0.94499999999999995,0.94099999999999995,0.91]
[60,0.93599999999999994,0.95,0.94499999999999995,0.91]
[75,0.93599999999999994,0.95400000000000007,0.94499999999999995,0.92400000000000004]
[100,0.94099999999999995,0.95400000000000007,0.95,0.92400000000000004]
[125,0.95,0.95400000000000007,0.95,0.93]
[150,0.95,0.95799999999999996,0.95799999999999996,0.93]
[200,0.95400000000000007,0.96200000000000008,0.95799999999999996,0.93599999999999994]
[250,0.95799999999999996,0.96200000000000008,0.95799999999999996,0.94099999999999995]
[300,0.95799999999999996,0.96200000000000008]
[350,0.95799999999999996,0.96200000000000008]
[400,0.95799999999999996,0.96200000000000008]
[450,0.95799999999999996,0.96200000000000008]
[500,0.95799999999999996,0.96200000000000008]
[]
[]
["DOE Term Sheet: Default Control Losses Determination: Recommendation 15"]
["Motor Horsepower (hp)","Coefficients for Motor and Control Part Load Loss Factor (zi) "]
[null,"a","b","c"]
["≤5 ",-0.46579999999999999,1.4964999999999999,0.53029999999999999]
[">5 and ≤20 ",-1.3198000000000001,2.9550999999999998,0.1052]
[">20 and ≤50 ",-1.5122,3.0777000000000001,0.1847]
[">50 ",-0.89139999999999997,2.8845999999999998,0.26250000000000001]
[]
["Motor Horsepower","a","b","c"]
[1,-0.46579999999999999,1.4964999999999999,0.53029999999999999]
[1.5,-0.46579999999999999,1.4964999999999999,0.53029999999999999]
[2,-0.46579999999999999,1.4964999999999999,0.53029999999999999]
[3,-0.46579999999999999,1.4964999999999999,0.53029999999999999]
[5,-0.46579999999999999,1.4964999999999999,0.53029999999999999]
[7.5,-1.3198000000000001,2.9550999999999998,0.1052]
[10,-1.3198000000000001,2.9550999999999998,0.1052]
[15,-1.3198000000000001,2.9550999999999998,0.1052]
[20,-1.3198000000000001,2.9550999999999998,0.1052]
[25,-1.5122,3.0777000000000001,0.1847]
[30,-1.5122,3.0777000000000001,0.1847]
[40,-1.5122,3.0777000000000001,0.1847]
[50,-1.5122,3.0777000000000001,0.1847]
[60,-0.89139999999999997,2.8845999999999998,0.26250000000000001]
[75,-0.89139999999999997,2.8845999999999998,0.26250000000000001]
[100,-0.89139999999999997,2.8845999999999998,0.26250000000000001]
[125,-0.89139999999999997,2.8845999999999998,0.26250000000000001]
[150,-0.89139999999999997,2.8845999999999998,0.26250000000000001]
[200,-0.89139999999999997,2.8845999999999998,0.26250000000000001]
[250,-0.89139999999999997,2.8845999999999998,0.26250000000000001]
[300,-0.89139999999999997,2.8845999999999998,0.26250000000000001]
[350,-0.89139999999999997,2.8845999999999998,0.26250000000000001]
[400,-0.89139999999999997,2.8845999999999998,0.26250000000000001]
[450,-0.89139999999999997,2.8845999999999998,0.26250000000000001]
[500,-0.89139999999999997,2.8845999999999998,0.26250000000000001]

{"sheet":"AMCA 208 Tables","index":2,"n_rows":30,"n_cols":7,"rows_kept":30,"cut":false,"hidden":true,"merged":[[1,4,1,5],[7,4,7,5]]}
[]
[null,null,null,null,"FEPref Constants, section 5.2"]
[null,null,null,null,"Q0",250]
[null,null,null,null,"P0",0.4]
[null,null,null,null,"η0,Total",0.66]
[null,null,null,null,"η0,Static",0.6]
[]
[null,null,null,null,"Ref Mtr Constants, section 5.2"]
[null,null,null,null,"A",-3.8E-3]
[null,null,null,null,"B",2.58E-2]
[null,null,null,null,"C",-7.2599999999999998E-2]
[null,null,null,null,"D",0.12559999999999999]
[null,null,null,null,"E",0.85029999999999994]
[]
["AMCA 208 Annex A, Table A.2 (draft, for lookup)"]
["Fan Category","Housing Type","Impeller Type","Test Standard","Test Config/\nInstallation Type","FEI Pressure Basis","Notes"]
["Centrifugal Housed","SW or DW Scroll (not inline)","AF, BC, BI, MF, FC, \nRadial, Radial Tipped","AMCA 210, ISO 5801","B or D","Total",1]
["Centrifugal Inline","Square, Rect, Cylindrical","AF, BC, BI, MF, FC","AMCA 210, ISO 5801","B or D","Total",1]
["Centrifugal Unhoused","None","AF, BC, BI, MF","AMCA 210, ISO 5801","A","Static",2]
["Centrifugal PRV Exhaust","Spun Alum, Upblast, Hooded, Wall Housing","AF, BC, BI, MF, FC","AMCA 210, ISO 5801","A or C","Static",3]
["Centrifugal PRV Supply","Hooded or otherwise enclosed","AF, BC, BI, MF, FC","AMCA 210, ISO 5801","B or D","Total",3]
["Axial Inline","Cylindrical","Propeller","AMCA 210, ISO 5801","B or D","Total",1]
["Axial Panel","Panel, Ring","Propeller","AMCA 210, ISO 5801","A","Static"]
["Axial PRV","Sup & Ex, Spun Alum, Upblast, Hooded, Wall Housing","Propeller","AMCA 210, ISO 5801","A or C","Static"]
["Laboratory Exhaust","High Velocity Discharge, Induced Flow","Any","AMCA 210, AMCA 260, ISO 5801","A or C","Total","4,5"]
["Jet Fan","Unidirectional, Reversible","Propeller or AF, BC, BI","AMCA 250,","E","Total","4,6"]
["Circulating","Cylindrical, Panel, Unhoused","Propeller","AMCA 230","E","Total","4,7"]
[]
[]
["AMCA 208 Annex A, Table A.2 (draft, complete)"]

{"sheet":"PSW_Sheet","index":3,"n_rows":0,"n_cols":0,"rows_kept":0,"cut":false,"hidden":true,"merged":[]}