{"text_format":"1","workbook":"xlsx","n_sheets":4,"sheets":["FEI Bubble","AMCA 207 Tables","AMCA 208 Tables","PSW_Sheet"],"not_rendered":{"charts":7,"images":2,"macros":1,"external_links":2,"defined_names":20,"comments":0,"pivot_tables":0},"unopened":[],"bounds":{"document_bytes":16777216,"sheet_cells":100000,"rows_first":2000,"rows_last":500,"rows_between":2000,"halvings":0,"cell_chars":16384,"cell_head_chars":4096},"cells_cut":0,"cells_raw":0,"read":"whole","date_system":"1900"}

{"sheet":"FEI Bubble","index":0,"n_rows":120,"n_cols":19,"rows_kept":120,"cut":false,"hidden":false,"merged":[[2,1,2,3],[15,10,15,13],[16,10,16,13],[16,14,16,15],[16,17,16,18],[6,1,6,2],[7,1,7,2],[8,1,8,2],[9,1,9,2],[17,0,17,2],[17,3,17,5],[15,1,15,2],[12,1,12,2],[14,1,14,2],[12,3,12,4]]}
[]
["Please fill the green colored cells."]
[null,"Please fill the green colored cells."]
[null,null,"Model","AAA"]
[null,null,"Size","AA27"]
[]
[null,"Impeller Dia (inches)",null,27]
[null,"Outlet Area (ft2)",null,7.92]
[null,"Max Catalog Speed (RPM)",null,1623]
[null,"Test Speed (RPM)",null,1100]
[null,null,"Drive type","V-Belt"]
[]
[null,"Fan Category",null,"Axial Inline"]
[null,null,"FEI Pressure Basis",{"$f":"VLOOKUP($D$13,'AMCA 208 Tables'!A17:F27,6,FALSE)","v":"Total"}]
[null,"Reference Target Efficiency",null,{"$f":"IF(D14=\"Total\", 0.66, 0.6)","v":0.66}]
[null,"Minimum FEI Level",null,1.1000000000000001,null,null,null,null,null,null,{"$f":"\"Reference Target Efficiency \"&D15*100&\"%\"","v":"Reference Target Efficiency 66%"}]
[null,null,null,null,null,null,null,null,null,null,{"$f":"\"Allowable Selection Range for FEI = \" & TEXT($D$16, \"0.00\") & \" per AMCA 208\"","v":"Allowable Selection Range for FEI = 1.10 per AMCA 208"},null,null,null,{"$f":" \"Maximum Allowable Speed for FEI= \" & TEXT($D$16, \"0.00\")","v":"Maximum Allowable Speed for FEI= 1.10"},null,null,"Fan Curves at Maximum Speeds"]
["Air Performance  at Test Speed",null,null,"Calculated",null,null,"Plotted Pressure",null,null,null,null,null,null,null,"Rmax=",{"$f":"MAX(K20:K130)","v":1623},null,"Max Structural Speed",{"$f":"D9","v":1623}]
["Airflow (CFM)","Test Static Pressure (in. wg)","Fan BHP","Total Pressure (in. wg)","SE","TE",{"$f":"IF($D$14=\"Total\", \"Total Pressure (in.wg)\",\"Static Pressure (in.wg)\")","v":"Total Pressure (in.wg)"},"Airflow (CFM)",{"$f":"IF($D$14=\"Total\", \"Total Pressure (in.wg)\",\"Static Pressure (in.wg)\")","v":"Total Pressure (in.wg)"},"Fan BHP at Test Speed","RPM","Qmax",{"$f":"IF($D$14=\"Total\",\"Ptmax\",IF($D$14=\"Static\",\"Psmax\",\"Not regulated\"))","v":"Ptmax"},"BHPmax","CFM",{"$f":"IF($D$14=\"Total\",\"Pt\",IF($D$14=\"No\",\"Ps\",\"Pressure\"))","v":"Pt"},"K","CFM",{"$f":"IF($D$14=\"Total\",\"Pt\",IF($D$14=\"No\",\"Ps\",\"Pressure\"))","v":"Pt"}]
[17210,1.9E-2,3.0720000000000001,{"$f":"IF(ISNUMBER(A20),B20+(A20/$D$8/4005)^2,\"\")","v":0.31337866851381624},{"$f":"IF(ISNUMBER(A20),A20*B20/6343/C20,\"\")","v":1.6781027477797049E-2},{"$f":"IF(ISNUMBER(A20),A20*D20/6343/C20,\"\")","v":0.27677979196241065},{"$f":"IF($D$14=\"Total\",D20,B20)","v":0.31337866851381624},{"$f":"A20","v":17210},{"$f":"IF($D$14=\"Total\",D20,B20)","v":0.31337866851381624},{"$f":"C20","v":3.0720000000000001},{"$f":"IF(H20<>0,RPM_AMCA208(H20,I20,J20,$D$10,$D$9,$D$15,$D$11,$D$16),0)","v":975},{"$f":"IF(ISNUMBER(H20),IF(H20=0,0,H20*(K20/$D$10)^1),\"\")","v":15254.318181818182},{"$f":"IF(ISNUMBER(H20),IF(H20=0,0,I20*(K20/$D$10)^2),\"\")","v":0.24620297252557569},{"$f":"IF(ISNUMBER(H20),IF(H20=0,0,J20*(K20/$D$10)^3),\"\")","v":2.1392276483846731},{"$f":"IF(ISNUMBER(A20),A20*($P$18/$D$10)^1,\"\")","v":25392.572727272727},{"$f":"IF(ISNUMBER(A20),G20*($P$18/$D$10)^2,\"\")","v":0.68221474273853722},{"$f":"IF(ISNUMBER(H20),IF(H20=0,0,I20/H20^2),\"\")","v":1.0580536514749315E-9},{"$f":"IF(ISNUMBER(A20),A20*($S$18/$D$10)^1,\"\")","v":25392.572727272727},{"$f":"IF(ISNUMBER(A20),G20*($S$18/$D$10)^2,\"\")","v":0.68221474273853722}]
[15611,0.86499999999999999,4.2359999999999998,1.1072177934209673,0.50256954607973492,0.64329935705315733,{"$f":"IF($D$14=\"Total\",D21,B21)","v":1.1072177934209673},{"$f":"H20+(H30-H20)*0.1","v":17050.099999999999},{"$f":"I20+(I30-I20)*0.1","v":0.39276258100453132},{"$f":"J20+(J30-J20)*0.1","v":3.1884000000000001},{"$f":"IF(H21<>0,RPM_AMCA208(H21,I21,J21,$D$10,$D$9,$D$15,$D$11,$D$16),0)","v":1018},{"$f":"IF(ISNUMBER(H21),IF(H21=0,0,H21*(K21/$D$10)^1),\"\")","v":15779.092545454543},{"$f":"IF(ISNUMBER(H21),IF(H21=0,0,I21*(K21/$D$10)^2),\"\")","v":0.33638784214623135},{"$f":"IF(ISNUMBER(H21),IF(H21=0,0,J21*(K21/$D$10)^3),\"\")","v":2.527191074041172},23033.320909090908,2.4103756189803129,{"$f":"IF(ISNUMBER(H21),IF(H21=0,0,I21/H21^2),\"\")","v":1.3510650023971676E-9},23033.320909090908,2.4103756189803129]
[13763,1.591,5.1319999999999997,1.7792655319440915,0.67266980041579894,0.75226787571310028,1.7792655319440915,{"$f":"H20+(H30-H20)*0.2","v":16890.2},{"$f":"I20+(I30-I20)*0.2","v":0.47214649349524646},{"$f":"J20+(J30-J20)*0.2","v":3.3048000000000002},{"$f":"IF(H22<>0,RPM_AMCA208(H22,I22,J22,$D$10,$D$9,$D$15,$D$11,$D$16),0)","v":1067},16383.494000000001,0.44424263572967737,3.0162017304000002,20306.680909090908,3.8734007738796339,1.6550350069724236E-9,20306.680909090908,3.8734007738796339]
[12350,2.048,5.5679999999999996,2.1995927778310804,0.71614831083591113,0.76915754510283096,2.1995927778310804,{"$f":"H20+(H30-H20)*0.3","v":16730.3},{"$f":"I20+(I30-I20)*0.3","v":0.55153040598596159},{"$f":"J20+(J30-J20)*0.3","v":3.4211999999999998},{"$f":"IF(H23<>0,RPM_AMCA208(H23,I23,J23,$D$10,$D$9,$D$15,$D$11,$D$16),0)","v":1121},17049.696636363635,0.57278985199058241,3.6209059594990225,18221.863636363636,4.7884389456821523,1.970434500436085E-9,18221.863636363636,4.7884389456821523]
[11033,2.3969999999999998,5.8949999999999996,2.5179850845534339,0.70726657063004283,0.74296482088014415,2.5179850845534339,{"$f":"H20+(H30-H20)*0.4","v":16570.400000000001},{"$f":"I20+(I30-I20)*0.4","v":0.63091431847667667},{"$f":"J20+(J30-J20)*0.4","v":3.5375999999999999},{"$f":"IF(H24<>0,RPM_AMCA208(H24,I24,J24,$D$10,$D$9,$D$15,$D$11,$D$16),0)","v":1182},17805.648000000001,0.72848391428711434,4.3891770468495857,16278.689999999999,5.481568208917067,2.2977585955855688E-9,16278.689999999999,5.481568208917067]
[9331,2.7080000000000002,5.875,2.7945368285398358,0.67806958919364957,0.69973797611319444,2.7945368285398358,{"$f":"H20+(H30-H20)*0.5","v":16410.5},{"$f":"I20+(I30-I20)*0.5","v":0.71029823096739175},{"$f":"J20+(J30-J20)*0.5","v":3.6539999999999999},{"$f":"IF(H25<>0,RPM_AMCA208(H25,I25,J25,$D$10,$D$9,$D$15,$D$11,$D$16),0)","v":1252},18678.132727272729,0.92016142002835577,5.3877008559218638,13767.466363636362,6.0836119848138903,2.6375281658224356E-9,13767.466363636362,6.0836119848138903]
[7673,2.7829999999999999,5.617,2.8415160486598214,0.59934828817868413,0.61195033402677779,2.8415160486598214,{"$f":"H20+(H30-H20)*0.6","v":16250.6},{"$f":"I20+(I30-I20)*0.6","v":0.78968214345810683},{"$f":"J20+(J30-J20)*0.6","v":3.7704},{"$f":"IF(H26<>0,RPM_AMCA208(H26,I26,J26,$D$10,$D$9,$D$15,$D$11,$D$16),0)","v":1335},19722.319090909092,1.1631332711773754,6.7398955836964687,11321.162727272727,6.1858841551572272,2.9902914336516761E-9,11321.162727272727,6.1858841551572272]
[5951,2.5680000000000001,4.8630000000000004,2.6031985275799556,0.49543420673967897,0.50222492114387685,2.6031985275799556,{"$f":"H20+(H30-H20)*0.7","v":16090.7},{"$f":"I20+(I30-I20)*0.7","v":0.86906605594882191},{"$f":"J20+(J30-J20)*0.7","v":3.8868},{"$f":"IF(H27<>0,RPM_AMCA208(H27,I27,J27,$D$10,$D$9,$D$15,$D$11,$D$16),0)","v":1433},20961.793727272729,1.474890567077926,8.593156271804359,8780.43,5.6670749869881485,3.3566256732316397E-9,8780.43,5.6670749869881485]
[4669,2.4529999999999998,4.2679999999999998,2.4746666787358458,0.42306032626273626,0.42679710252650177,2.4746666787358458,{"$f":"H20+(H30-H20)*0.8","v":15930.8},{"$f":"I20+(I30-I20)*0.8","v":0.94844996843953711},{"$f":"J20+(J30-J20)*0.8","v":4.0031999999999996},{"$f":"IF(H28<>0,RPM_AMCA208(H28,I28,J28,$D$10,$D$9,$D$15,$D$11,$D$16),0)","v":1554},22505.875636363638,1.8929148793257302,11.287097483309392,6888.8972727272721,5.3872655072659281,3.7371390363600699E-9,6888.8972727272721,5.3872655072659281]
[2994,3.09,4.8890000000000002,3.0989093944684738,0.2983290373744712,0.29918920924352277,3.0989093944684738,{"$f":"H20+(H30-H20)*0.9","v":15770.9},{"$f":"I20+(I30-I20)*0.9","v":1.0278338809302521},{"$f":"J20+(J30-J20)*0.9","v":4.1196000000000002},{"$f":"IF(H29<>0,RPM_AMCA208(H29,I29,J29,$D$10,$D$9,$D$15,$D$11,$D$16),0)","v":1623},23269.246090909088,2.2375595313561352,13.232215143120358,4417.5109090909091,6.7462207473899545,4.132472512155431E-9,4417.5109090909091,6.7462207473899545]
[2005,3.4969999999999999,5.3639999999999999,{"$f":"IF(ISNUMBER(A30),B30+(A30/$D$8/4005)^2,\"\")","v":3.5009955203769958},{"$f":"IF(ISNUMBER(A30),A30*B30/6343/C30,\"\")","v":0.20607557897912324},{"$f":"IF(ISNUMBER(A30),A30*D30/6343/C30,\"\")","v":0.2063110319888494},3.5009955203769958,{"$f":"A21","v":15611},{"$f":"IF($D$14=\"Total\",D21,B21)","v":1.1072177934209673},{"$f":"C21","v":4.2359999999999998},{"$f":"IF(H30<>0,RPM_AMCA208(H30,I30,J30,$D$10,$D$9,$D$15,$D$11,$D$16),0)","v":1623},23033.320909090908,2.4103756189803129,13.606093636823436,2958.2863636363636,7.6215486190868873,4.5433020316574486E-9,2958.2863636363636,7.6215486190868873]
[null,null,null,"","","",null,{"$f":"H30+(H40-H30)*0.1","v":15426.2},{"$f":"I30+(I40-I30)*0.1","v":1.1744225672732798},{"$f":"J30+(J40-J30)*0.1","v":4.3255999999999997},{"$f":"IF(H31<>0,RPM_AMCA208(H31,I31,J31,$D$10,$D$9,$D$15,$D$11,$D$16),0)","v":1623},22760.656909090907,2.5566781344702449,13.893890140567388,"","",null,"",""]
[null,null,null,null,null,null,null,{"$f":"H30+(H40-H30)*0.2","v":15241.4},{"$f":"I30+(I40-I30)*0.2","v":1.241627341125592},{"$f":"J30+(J40-J30)*0.2","v":4.4151999999999996},{"$f":"IF(H32<>0,RPM_AMCA208(H32,I32,J32,$D$10,$D$9,$D$15,$D$11,$D$16),0)","v":1623},22487.992909090906,2.702980649960177,14.181686644311339,"","",null,"",""]
[null,null,null,null,null,null,null,{"$f":"H30+(H40-H30)*0.3","v":15056.6},{"$f":"I30+(I40-I30)*0.3","v":1.3088321149779045},{"$f":"J30+(J40-J30)*0.3","v":4.5047999999999995},{"$f":"IF(H33<>0,RPM_AMCA208(H33,I33,J33,$D$10,$D$9,$D$15,$D$11,$D$16),0)","v":1623},22215.328909090909,2.849283165450109,14.469483148055291,"","",null,"",""]
[null,null,null,null,null,null,null,{"$f":"H30+(H40-H30)*0.4","v":14871.8},{"$f":"I30+(I40-I30)*0.4","v":1.376036888830217},{"$f":"J30+(J40-J30)*0.4","v":4.5943999999999994},{"$f":"IF(H34<>0,RPM_AMCA208(H34,I34,J34,$D$10,$D$9,$D$15,$D$11,$D$16),0)","v":1623},21942.664909090905,2.9955856809400414,14.757279651799243,"","",null,"",""]
[null,null,null,null,null,null,null,{"$f":"H30+(H40-H30)*0.5","v":14687},{"$f":"I30+(I40-I30)*0.5","v":1.4432416626825293},{"$f":"J30+(J40-J30)*0.5","v":4.6839999999999993},{"$f":"IF(H35<>0,RPM_AMCA208(H35,I35,J35,$D$10,$D$9,$D$15,$D$11,$D$16),0)","v":1623},21670.000909090908,3.141888196429973,15.045076155543194,"","",null,"",""]
[null,null,null,null,null,null,null,{"$f":"H30+(H40-H30)*0.6","v":14502.2},{"$f":"I30+(I40-I30)*0.6","v":1.5104464365348418},{"$f":"J30+(J40-J30)*0.6","v":4.7736000000000001},{"$f":"IF(H36<>0,RPM_AMCA208(H36,I36,J36,$D$10,$D$9,$D$15,$D$11,$D$16),0)","v":1623},21397.336909090907,3.2881907119199054,15.332872659287149,"","",null,"",""]
[null,null,null,null,null,null,null,{"$f":"H30+(H40-H30)*0.7","v":14317.4},{"$f":"I30+(I40-I30)*0.7","v":1.5776512103871543},{"$f":"J30+(J40-J30)*0.7","v":4.8632},{"$f":"IF(H37<>0,RPM_AMCA208(H37,I37,J37,$D$10,$D$9,$D$15,$D$11,$D$16),0)","v":1623},21124.672909090907,3.4344932274098374,15.620669163031101,"","",null,"",""]
[null,null,null,null,null,null,null,{"$f":"H30+(H40-H30)*0.8","v":14132.6},{"$f":"I30+(I40-I30)*0.8","v":1.6448559842394666},{"$f":"J30+(J40-J30)*0.8","v":4.9527999999999999},{"$f":"IF(H38<>0,RPM_AMCA208(H38,I38,J38,$D$10,$D$9,$D$15,$D$11,$D$16),0)","v":1623},20852.00890909091,3.5807957428997694,15.908465666775053,"","",null,"",""]
[null,null,null,null,null,null,null,{"$f":"H30+(H40-H30)*0.9","v":13947.8},{"$f":"I30+(I40-I30)*0.9","v":1.7120607580917793},{"$f":"J30+(J40-J30)*0.9","v":5.0423999999999998},{"$f":"IF(H39<>0,RPM_AMCA208(H39,I39,J39,$D$10,$D$9,$D$15,$D$11,$D$16),0)","v":1623},20579.344909090905,3.7270982583897019,16.196262170519002,"","",null,"",""]
[null,null,null,null,null,null,null,{"$f":"A22","v":13763},{"$f":"IF($D$14=\"Total\",D22,B22)","v":1.7792655319440915},{"$f":"C22","v":5.1319999999999997},{"$f":"IF(H40<>0,RPM_AMCA208(H40,I40,J40,$D$10,$D$9,$D$15,$D$11,$D$16),0)","v":1623},20306.680909090908,3.8734007738796339,16.484058674262954,"","",null,"",""]
[null,null,null,null,null,null,null,{"$f":"H40+(H50-H40)*0.1","v":13621.7},{"$f":"I40+(I50-I40)*0.1","v":1.8212982565327904},{"$f":"J40+(J50-J40)*0.1","v":5.1755999999999993},{"$f":"IF(H41<>0,RPM_AMCA208(H41,I41,J41,$D$10,$D$9,$D$15,$D$11,$D$16),0)","v":1623},20098.199181818181,3.9649045910598857,16.624102508674074,"","",null,"",""]
[null,null,null,null,null,null,null,{"$f":"H40+(H50-H40)*0.2","v":13480.4},{"$f":"I40+(I50-I40)*0.2","v":1.8633309811214893},{"$f":"J40+(J50-J40)*0.2","v":5.2191999999999998},{"$f":"IF(H42<>0,RPM_AMCA208(H42,I42,J42,$D$10,$D$9,$D$15,$D$11,$D$16),0)","v":1623},19889.717454545451,4.0564084082401379,16.764146343085194,"","",null,"",""]
[null,null,null,null,null,null,null,{"$f":"H40+(H50-H40)*0.3","v":13339.1},{"$f":"I40+(I50-I40)*0.3","v":1.9053637057101882},{"$f":"J40+(J50-J40)*0.3","v":5.2627999999999995},{"$f":"IF(H43<>0,RPM_AMCA208(H43,I43,J43,$D$10,$D$9,$D$15,$D$11,$D$16),0)","v":1623},19681.235727272728,4.1479122254203897,16.904190177496314,"","",null,"",""]
[null,null,null,null,null,null,null,{"$f":"H40+(H50-H40)*0.4","v":13197.8},{"$f":"I40+(I50-I40)*0.4","v":1.9473964302988871},{"$f":"J40+(J50-J40)*0.4","v":5.3064},{"$f":"IF(H44<>0,RPM_AMCA208(H44,I44,J44,$D$10,$D$9,$D$15,$D$11,$D$16),0)","v":1623},19472.753999999997,4.2394160426006415,17.044234011907434,"","",null,"",""]
[null,null,null,null,null,null,null,{"$f":"H40+(H50-H40)*0.5","v":13056.5},{"$f":"I40+(I50-I40)*0.5","v":1.989429154887586},{"$f":"J40+(J50-J40)*0.5","v":5.35},{"$f":"IF(H45<>0,RPM_AMCA208(H45,I45,J45,$D$10,$D$9,$D$15,$D$11,$D$16),0)","v":1623},19264.27227272727,4.3309198597808933,17.184277846318551,"","",null,"",""]
[null,null,null,null,null,null,null,{"$f":"H40+(H50-H40)*0.6","v":12915.2},{"$f":"I40+(I50-I40)*0.6","v":2.0314618794762849},{"$f":"J40+(J50-J40)*0.6","v":5.3935999999999993},{"$f":"IF(H46<>0,RPM_AMCA208(H46,I46,J46,$D$10,$D$9,$D$15,$D$11,$D$16),0)","v":1623},19055.790545454543,4.4224236769611451,17.324321680729671,"","",null,"",""]
[null,null,null,null,null,null,null,{"$f":"H40+(H50-H40)*0.7","v":12773.9},{"$f":"I40+(I50-I40)*0.7","v":2.073494604064984},{"$f":"J40+(J50-J40)*0.7","v":5.4371999999999998},{"$f":"IF(H47<>0,RPM_AMCA208(H47,I47,J47,$D$10,$D$9,$D$15,$D$11,$D$16),0)","v":1623},18847.308818181817,4.5139274941413978,17.464365515140791,"","",null,"",""]
[null,null,null,null,null,null,null,{"$f":"H40+(H50-H40)*0.8","v":12632.6},{"$f":"I40+(I50-I40)*0.8","v":2.1155273286536826},{"$f":"J40+(J50-J40)*0.8","v":5.4807999999999995},{"$f":"IF(H48<>0,RPM_AMCA208(H48,I48,J48,$D$10,$D$9,$D$15,$D$11,$D$16),0)","v":1623},18638.82709090909,4.6054313113216487,17.604409349551911,"","",null,"",""]
[null,null,null,null,null,null,null,{"$f":"H40+(H50-H40)*0.9","v":12491.3},{"$f":"I40+(I50-I40)*0.9","v":2.1575600532423813},{"$f":"J40+(J50-J40)*0.9","v":5.5244},{"$f":"IF(H49<>0,RPM_AMCA208(H49,I49,J49,$D$10,$D$9,$D$15,$D$11,$D$16),0)","v":1623},18430.345363636363,4.6969351285019005,17.744453183963032,"","",null,"",""]
[null,null,null,null,null,null,null,{"$f":"A23","v":12350},{"$f":"IF($D$14=\"Total\",D23,B23)","v":2.1995927778310804},{"$f":"C23","v":5.5679999999999996},{"$f":"IF(H50<>0,RPM_AMCA208(H50,I50,J50,$D$10,$D$9,$D$15,$D$11,$D$16),0)","v":1623},18221.863636363636,4.7884389456821523,17.884497018374148,"","",null,"",""]
[null,null,null,null,null,null,null,{"$f":"H50+(H60-H50)*0.1","v":12218.3},{"$f":"I50+(I60-I50)*0.1","v":2.2314320085033157},{"$f":"J50+(J60-J50)*0.1","v":5.6006999999999998},{"$f":"IF(H51<>0,RPM_AMCA208(H51,I51,J51,$D$10,$D$9,$D$15,$D$11,$D$16),0)","v":1623},18027.546272727272,4.8577518720056441,17.989529894182489,"","",null,"",""]
[null,null,null,null,null,null,null,{"$f":"H50+(H60-H50)*0.2","v":12086.6},{"$f":"I50+(I60-I50)*0.2","v":2.263271239175551},{"$f":"J50+(J60-J50)*0.2","v":5.6334},{"$f":"IF(H52<>0,RPM_AMCA208(H52,I52,J52,$D$10,$D$9,$D$15,$D$11,$D$16),0)","v":1623},17833.228909090907,4.9270647983291349,18.09456276999083,{"$f":"IF(ISNUMBER(A52),A52*($P$18/$D$10)^1,\"\")","v":""},{"$f":"IF(ISNUMBER(A52),G52*($P$18/$D$10)^2,\"\")","v":""},null,{"$f":"IF(ISNUMBER(A52),A52*($S$18/$D$10)^1,\"\")","v":""},{"$f":"IF(ISNUMBER(A52),G52*($S$18/$D$10)^2,\"\")","v":""}]
[null,null,null,null,null,null,null,{"$f":"H50+(H60-H50)*0.3","v":11954.9},{"$f":"I50+(I60-I50)*0.3","v":2.2951104698477867},{"$f":"J50+(J60-J50)*0.3","v":5.6660999999999992},{"$f":"IF(H53<>0,RPM_AMCA208(H53,I53,J53,$D$10,$D$9,$D$15,$D$11,$D$16),0)","v":1623},17638.911545454543,4.9963777246526275,18.199595645799167,"","",null,"",""]
[null,null,null,null,null,null,null,{"$f":"H50+(H60-H50)*0.4","v":11823.2},{"$f":"I50+(I60-I50)*0.4","v":2.3269497005200219},{"$f":"J50+(J60-J50)*0.4","v":5.6987999999999994},{"$f":"IF(H54<>0,RPM_AMCA208(H54,I54,J54,$D$10,$D$9,$D$15,$D$11,$D$16),0)","v":1623},17444.594181818182,5.0656906509761184,18.304628521607508,"","",null,"",""]
[null,null,null,null,null,null,null,{"$f":"H50+(H60-H50)*0.5","v":11691.5},{"$f":"I50+(I60-I50)*0.5","v":2.3587889311922572},{"$f":"J50+(J60-J50)*0.5","v":5.7314999999999996},{"$f":"IF(H55<>0,RPM_AMCA208(H55,I55,J55,$D$10,$D$9,$D$15,$D$11,$D$16),0)","v":1623},17250.276818181817,5.1350035772996101,18.409661397415846,"","",null,"",""]
[null,null,null,null,null,null,null,{"$f":"H50+(H60-H50)*0.6","v":11559.8},{"$f":"I50+(I60-I50)*0.6","v":2.3906281618644925},{"$f":"J50+(J60-J50)*0.6","v":5.7641999999999998},{"$f":"IF(H56<>0,RPM_AMCA208(H56,I56,J56,$D$10,$D$9,$D$15,$D$11,$D$16),0)","v":1623},17055.959454545453,5.2043165036231009,18.514694273224187,"","",null,"",""]
[null,null,null,null,null,null,null,{"$f":"H50+(H60-H50)*0.7","v":11428.1},{"$f":"I50+(I60-I50)*0.7","v":2.4224673925367277},{"$f":"J50+(J60-J50)*0.7","v":5.7968999999999999},{"$f":"IF(H57<>0,RPM_AMCA208(H57,I57,J57,$D$10,$D$9,$D$15,$D$11,$D$16),0)","v":1623},16861.642090909092,5.2736294299465927,18.619727149032528,"","",null,"",""]
[null,null,null,null,null,null,null,{"$f":"H50+(H60-H50)*0.8","v":11296.4},{"$f":"I50+(I60-I50)*0.8","v":2.4543066232089634},{"$f":"J50+(J60-J50)*0.8","v":5.8295999999999992},{"$f":"IF(H58<>0,RPM_AMCA208(H58,I58,J58,$D$10,$D$9,$D$15,$D$11,$D$16),0)","v":1623},16667.324727272724,5.3429423562700844,18.724760024840865,"","",null,"",""]
[null,null,null,null,null,null,null,{"$f":"H50+(H60-H50)*0.9","v":11164.7},{"$f":"I50+(I60-I50)*0.9","v":2.4861458538811987},{"$f":"J50+(J60-J50)*0.9","v":5.8622999999999994},{"$f":"IF(H59<>0,RPM_AMCA208(H59,I59,J59,$D$10,$D$9,$D$15,$D$11,$D$16),0)","v":1623},16473.007363636363,5.4122552825935761,18.829792900649206,"","",null,"",""]
[null,null,null,null,null,null,null,{"$f":"A24","v":11033},{"$f":"IF($D$14=\"Total\",D24,B24)","v":2.5179850845534339},{"$f":"C24","v":5.8949999999999996},{"$f":"IF(H60<>0,RPM_AMCA208(H60,I60,J60,$D$10,$D$9,$D$15,$D$11,$D$16),0)","v":1623},16278.689999999999,5.481568208917067,18.934825776457544,"","",null,"",""]
{"$rows_left_out":61}
{"sheet":"AMCA 207 Tables","index":1,"n_rows":481,"n_cols":13,"rows_kept":481,"cut":false,"hidden":true,"merged":[[447,0,447,3],[448,1,448,3],[362,0,362,4],[363,1,363,4],[387,0,387,4],[388,1,388,4],[417,0,417,4],[418,1,418,4],[339,1,339,4],[273,0,273,12],[274,0,275,0],[274,1,274,3],[274,4,274,5],[274,6,274,8],[274,9,274,11],[306,0,307,2],[308,0,308,2],[309,1,309,2],[337,0,337,4],[338,0,338,4],[245,1,245,3],[245,4,245,6],[245,7,245,9],[245,10,245,12],[150,0,151,0],[150,1,150,3],[150,4,150,6],[150,7,150,9],[150,10,150,12],[183,0,183,3],[211,0,211,3],[244,0,244,12],[245,0,246,0],[121,10,121,12],[149,0,149,12],[90,0,90,9],[91,0,92,0],[91,1,91,3],[91,4,91,6],[91,7,91,9],[120,0,120,12],[121,0,122,0],[121,1,121,3],[121,4,121,6],[121,7,121,9],[59,0,61,0],[59,1,59,3],[59,4,59,6],[59,7,59,9],[0,0,0,4],[1,1,1,4],[29,0,29,4],[30,1,30,4],[58,0,58,9]]}
["Table A1.  EISA 2007 Nominal Motor Effciency"]
["Motor Power (hp)","ODP"]
[null,2,4,6,8]
[1,0.77,0.85499999999999998,0.82499999999999996,0.755]
[1.5,0.84,0.86499999999999999,0.86499999999999999,0.78500000000000003]
[2,0.85499999999999998,0.86499999999999999,0.875,0.84]
[3,0.85499999999999998,0.89500000000000002,0.88500000000000001,0.85499999999999998]
[5,0.86499999999999999,0.89500000000000002,0.89500000000000002,0.86499999999999999]
[7.5,0.88500000000000001,0.91,0.90200000000000002,0.86499999999999999]
[10,0.89500000000000002,0.91700000000000004,0.91700000000000004,0.89500000000000002]
[15,0.90200000000000002,0.93,0.91700000000000004,0.89500000000000002]
[20,0.91,0.93,0.92400000000000004,0.90200000000000002]
[25,0.91700000000000004,0.93600000000000005,0.93,0.90200000000000002]
[30,0.91700000000000004,0.94099999999999995,0.93600000000000005,0.91700000000000004]
[40,0.92400000000000004,0.94099999999999995,0.94099999999999995,0.91700000000000004]
[50,0.93,0.94499999999999995,0.94099999999999995,0.92400000000000004]
[60,0.93600000000000005,0.95,0.94499999999999995,0.92400000000000004]
[75,0.93600000000000005,0.95,0.94499999999999995,0.93600000000000005]
[100,0.93600000000000005,0.95399999999999996,0.95,0.94099999999999995]
[125,0.94099999999999995,0.95399999999999996,0.95,0.94099999999999995]
[150,0.94099999999999995,0.95799999999999996,0.95399999999999996,0.94499999999999995]
[200,0.95,0.95799999999999996,0.95399999999999996,0.94499999999999995]
[250,0.95,0.95799999999999996,0.95799999999999996,0.95]
[300,0.95399999999999996,0.95799999999999996,0.95799999999999996]
[350,0.95399999999999996,0.95799999999999996,0.95499999999999996]
[400,0.95799999999999996,0.95799999999999996]
[450,0.96199999999999997,0.96199999999999997]
[500,0.96199999999999997,0.96199999999999997]
[]
["Table A1.  EISA 2007 Nominal Motor Effciency"]
["Motor Power (hp)","TEFC"]
[null,2,4,6,8]
[1,0.77,0.85499999999999998,0.82499999999999996,0.72]
[1.5,0.84,0.86499999999999999,0.875,0.755]
[2,0.85499999999999998,0.86499999999999999,0.88500000000000001,0.81499999999999995]
[3,0.86499999999999999,0.89500000000000002,0.89500000000000002,0.82499999999999996]
[5,0.88500000000000001,0.89500000000000002,0.89500000000000002,0.84]
[7.5,0.89500000000000002,0.91700000000000004,0.91,0.84]
[10,0.90200000000000002,0.91700000000000004,0.91,0.875]
[15,0.91,0.92400000000000004,0.91700000000000004,0.875]
[20,0.91,0.93,0.91700000000000004,0.88500000000000001]
[25,0.91700000000000004,0.93600000000000005,0.93,0.88500000000000001]
[30,0.91700000000000004,0.93600000000000005,0.93,0.90200000000000002]
[40,0.92400000000000004,0.94099999999999995,0.94099999999999995,0.90200000000000002]
[50,0.93,0.94499999999999995,0.94099999999999995,0.91]
[60,0.93600000000000005,0.95,0.94499999999999995,0.91]
[75,0.93600000000000005,0.95399999999999996,0.94499999999999995,0.92400000000000004]
[100,0.94099999999999995,0.95399999999999996,0.95,0.92400000000000004]
[125,0.95,0.95399999999999996,0.95,0.93]
[150,0.95,0.95799999999999996,0.95799999999999996,0.93]
[200,0.95399999999999996,0.96199999999999997,0.95799999999999996,0.93600000000000005]
[250,0.95799999999999996,0.96199999999999997,0.95799999999999996,0.94099999999999995]
[300,0.95799999999999996,0.96199999999999997]
[350,0.95799999999999996,0.96199999999999997]
[400,0.95799999999999996,0.96199999999999997]
[450,0.95799999999999996,0.96199999999999997]
[500,0.95799999999999996,0.96199999999999997]
[]
["Table A2.  IEC60034-30 Nominal Motor Efficiency"]
["Motor Power (kW)","IE1",null,null,"IE2",null,null,"IE3"]
{"$rows_left_out":422}
{"sheet":"AMCA 208 Tables","index":2,"n_rows":30,"n_cols":7,"rows_kept":30,"cut":false,"hidden":true,"merged":[[1,4,1,5],[7,4,7,5]]}
[]
[null,null,null,null,"FEPref Constants, section 5.2"]
[null,null,null,null,"Q0",250]
[null,null,null,null,"P0",0.4]
[null,null,null,null,"η0,Total",0.66]
[null,null,null,null,"η0,Static",0.6]
[]
[null,null,null,null,"Ref Mtr Constants, section 5.2"]
[null,null,null,null,"A",-3.8E-3]
[null,null,null,null,"B",2.58E-2]
[null,null,null,null,"C",-7.2599999999999998E-2]
[null,null,null,null,"D",0.12559999999999999]
[null,null,null,null,"E",0.85029999999999994]
[]
["AMCA 208 Annex A, Table A.2 (draft, for lookup)"]
["Fan Category","Housing Type","Impeller Type","Test Standard","Test Config/\nInstallation Type","FEI Pressure Basis","Notes"]
["Centrifugal Housed","SW or DW Scroll (not inline)","AF, BC, BI, MF, FC, \nRadial, Radial Tipped","AMCA 210, ISO 5801","B or D","Total",1]
["Centrifugal Inline","Square, Rect, Cylindrical","AF, BC, BI, MF, FC","AMCA 210, ISO 5801","B or D","Total",1]
["Centrifugal Unhoused","None","AF, BC, BI, MF","AMCA 210, ISO 5801","A","Static",2]
["Centrifugal PRV Exhaust","Spun Alum, Upblast, Hooded, Wall Housing","AF, BC, BI, MF, FC","AMCA 210, ISO 5801","A or C","Static",3]
["Centrifugal PRV Supply","Hooded or otherwise enclosed","AF, BC, BI, MF, FC","AMCA 210, ISO 5801","B or D","Total",3]
["Axial Inline","Cylindrical","Propeller","AMCA 210, ISO 5801","B or D","Total",1]
["Axial Panel","Panel, Ring","Propeller","AMCA 210, ISO 5801","A","Static"]
["Axial PRV","Sup & Ex, Spun Alum, Upblast, Hooded, Wall Housing","Propeller","AMCA 210, ISO 5801","A or C","Static"]
["Laboratory Exhaust","High Velocity Discharge, Induced Flow","Any","AMCA 210, AMCA 260, ISO 5801","A or C","Total","4,5"]
["Jet Fan","Unidirectional, Reversible","Propeller or AF, BC, BI","AMCA 250,","E","Total","4,6"]
["Circulating","Cylindrical, Panel, Unhoused","Propeller","AMCA 230","E","Total","4,7"]
[]
[]
["AMCA 208 Annex A, Table A.2 (draft, complete)"]

{"sheet":"PSW_Sheet","index":3,"n_rows":0,"n_cols":0,"rows_kept":0,"cut":false,"hidden":true,"merged":[]}